program: Gaussian 09
title: 000088630
version: EM64L-G09RevD.01
frameworkgroup: C1[X(C12H16O2)]
method: RPBEPBE
basis: SDD
operation: Freq
keyword: #pfreq=noraman
keyword: PBEPBE/SDD
title: #p freq=noraman PBEPBE/SDD
converged: YES YES NO NO
title: Mulliken charges:
elementType: O O C C C C C C C C C C C C H H H H H H H H H H H H H H H H
charge: -0.289712 -0.257999 -0.356672 -0.562470 -0.339914 0.519004 -0.411340 -0.399852 -0.693826 0.233645 -0.353663 -0.339066 0.171641 -0.501382 0.207570 0.206123 0.206822 0.206038 0.196477 0.195159 0.237494 0.235552 0.212402 0.211597 0.217497 0.267040 0.268267 0.230264 0.241716 0.241588
chargesum: 0.00000
title: Mulliken charges with hydrogens summed into heavy atoms:
elementType: O O C C C C C C C C C C C C
charge: -0.289712 -0.257999 0.057022 -0.149611 0.051721 0.519004 -0.173846 -0.164300 -0.052330 0.233645 -0.086622 -0.070799 0.171641 0.212186
polarizability: 2.10287215e+02 -3.77508114e+00 1.26735268e+02 1.26179165e+01 8.16061024e+00 8.76677334e+01
1716.lowfreq: -8.2437 -0.7259 -0.0008 -0.0007 -0.0004 8.0051 23.2872 40.9781 62.7366
frequency: 20.5558 40.7979 62.7315 67.2862 96.2936 110.9778 113.5186 142.0575 170.2976 224.0666 227.5327 279.6640 290.0772 341.2202 376.2211 392.6767 405.8393 470.0755 525.4236 625.6874 633.1896 685.8063 732.8288 746.6484 762.9041 789.7313 813.2120 857.1110 862.5055 904.4075 918.5580 924.4228 985.3218 995.3353 1007.7318 1013.3037 1062.1805 1067.3341 1074.6811 1104.7664 1114.5869 1125.6684 1147.6001 1184.9246 1205.1773 1217.2342 1254.6795 1255.9851 1269.9004 1285.4588 1309.7927 1319.6643 1345.3237 1386.4014 1391.0547 1411.4335 1424.5128 1451.7147 1464.3973 1466.1112 1470.6542 1477.5402 1481.4295 1489.3364 1500.3620 1573.8753 1619.5745 1623.3570 2963.2164 2970.9733 2974.3485 2981.7181 3002.3276 3003.1901 3023.6312 3048.9446 3071.5468 3073.3214 3102.8761 3123.6018 3126.6104 3145.4150 3159.1754 3172.9823
redmass: 3.6374 4.1474 3.2854 1.7414 1.3922 2.3938 2.4423 3.3350 3.9179 3.1016 1.2212 4.5623 3.9301 2.9660 4.7597 3.2059 2.8700 5.6668 3.0935 5.3416 6.8687 4.2251 1.0741 4.5134 4.7326 1.1784 4.6973 1.6775 1.2873 1.7516 1.5151 3.6669 1.3828 1.3780 4.0091 3.1559 2.0560 2.5230 2.2129 2.1836 1.2637 1.2844 1.4716 1.1273 1.4988 2.3959 3.7715 1.4333 1.2349 1.0705 1.2717 1.4107 1.5580 5.2552 1.2130 3.2416 1.1883 1.0497 1.0519 1.0744 1.0775 1.0422 1.0744 1.0944 2.6541 7.3155 6.3709 9.9231 1.0587 1.0588 1.0369 1.0592 1.0296 1.0992 1.1024 1.1047 1.1008 1.0994 1.1043 1.0896 1.0894 1.1046 1.0952 1.0949
irintensity: 0.3136 0.2676 0.9819 0.1126 1.2269 0.2024 0.2895 1.4613 4.5774 0.5448 0.1545 7.4159 10.8028 5.1817 0.9520 0.3756 0.0159 4.1807 12.5042 1.6168 0.8004 33.4361 7.1860 9.7572 6.1463 0.9651 4.0407 29.3211 3.5247 10.3070 0.1543 4.7218 1.4620 0.2245 0.1587 36.9612 115.8197 6.0957 82.5781 31.2803 0.0646 7.0561 64.2489 43.3462 0.5505 0.0684 279.3577 18.2962 0.8716 1.0284 0.8378 3.0358 0.0745 3.4820 12.0259 12.9137 35.7284 13.6073 11.9945 0.3381 0.6048 12.8860 3.0589 18.8723 10.8878 19.9462 64.7581 224.4385 15.5846 8.0455 38.5949 85.4570 44.2186 2.9225 2.4061 37.8696 83.7933 54.9347 28.0721 16.3043 14.1055 17.0973 6.7526 2.5049
temp: 298.150 k
press: 1.00000 atm
elementType: 8 8 6 6 6 6 6 6 6 6 6 6 6 6 1 1 1 1 1 1 1 1 1 1 1 1 1 1 1 1
symmnumber: 1
zpe: 658763.2 jmol-1
zpe.correction: 0.250910 hartree
zpe.thermalcorrener: 0.265897 hartree
zpe.thermalcorrenthalpy: 0.266841 hartree
zpe.thermalcorrgfe: 0.206776 hartree
zpe.sumelectzpe: -616.276039 hartree
zpe.sumelectthermal: -616.261051 hartree
zpe.sumelectthermalent: -616.260107 hartree
zpe.sumelectthermalfe: -616.320172 hartree
dipole: -1.7634 -1.7051 -0.5212
dipole: 2.5077
quadrupole: -74.2757 -82.1776 -86.5228
quadrupole: -10.2157 0.7232 -0.1674
quadrupole: 6.7163 -1.1856 -5.5307 -10.2157 0.7232 -0.1674
hfenergy: -616.5269482 hartree
pointgroup: C01 [X(C12H16O2)]
dipole: 0.6969677 0.6804744 -0.1568499 debye
polarizability: 210.3117419|-3.2318793|127.6996904|-12.6269286|-5.3417942|86.6787838 unknown
InChI: InChI=1S/C12H16O2/c1-3-4-5-10-6-8-11(9-7-10)12(13)14-2/h6-9H,3-5H2,1-2H3
charge 0 multiplicity 1
30 atoms
O  -3.686906 1.020819 0.182024
O  -3.729422 -1.280965 0.541313
C  3.477135 0.140105 0.309543
C  2.64805 -0.182671 -0.967043
C  4.998912 0.162348 0.042254
C  1.153044 -0.19416 -0.696419
C  0.480373 -1.398916 -0.358655
C  0.400545 1.010777 -0.72704
C  5.820726 0.489637 1.307752
C  -1.633837 -0.191118 -0.086232
C  -0.894865 -1.40217 -0.05678
C  -0.97544 1.019483 -0.426391
C  -3.084806 -0.244493 0.240881
C  -5.13222 1.047123 0.500028
H  3.246299 -0.610053 1.092572
H  3.155706 1.121137 0.713882
H  2.972595 -1.165977 -1.359855
H  2.889671 0.570888 -1.742439
H  5.31338 -0.821413 -0.362405
H  5.219949 0.908817 -0.748093
H  1.043234 -2.339951 -0.337024
H  0.902194 1.949054 -0.994029
H  5.640636 -0.258777 2.10221
H  5.544975 1.481249 1.713209
H  6.905178 0.501326 1.093682
H  -1.418794 -2.328535 0.201374
H  -1.550529 1.949253 -0.453488
H  -5.420037 2.104394 0.413421
H  -5.30728 0.669031 1.521509
H  -5.693568 0.421959 -0.214862
