program: Gaussian 09
title: 000088626
version: EM64L-G09RevD.01
frameworkgroup: C1[X(C9H12N2O)]
method: RPBEPBE
basis: SDD
operation: Freq
keyword: #p
keyword: freq=noraman
keyword: PBEPBE/SDD
title: #p freq=noraman PBEPBE/SDD
converged: YES YES NO NO
title: Mulliken charges:
elementType: O N N C C C C C C C C C H H H H H H H H H H H H
charge: -0.309951 -0.273441 -0.646866 0.223180 0.359712 -0.341473 -0.396461 -0.808845 -0.635476 -0.231466 -0.233352 0.231195 0.253244 0.235861 0.254883 0.239600 0.222001 0.221480 0.225344 0.279033 0.232051 0.229833 0.333471 0.336443
chargesum: 0.00000
title: Mulliken charges with hydrogens summed into heavy atoms:
elementType: O N N C C C C C C C C C
charge: -0.309951 -0.273441 0.023048 0.223180 0.359712 -0.088229 -0.160599 -0.092361 0.090381 0.000585 -0.003519 0.231195
polarizability: 1.44236746e+02 -2.71611934e+00 1.07113969e+02 -6.15716202e+00 2.54468562e+00 7.98415786e+01
1716.lowfreq: -13.3905 -3.5683 -0.0006 0.0002 0.0006 14.3035 32.3622 77.3651 90.7959
frequency: 31.3410 77.3468 90.7605 95.1383 124.8481 149.3087 185.5301 260.9646 304.7063 325.6993 379.0270 442.9854 453.7803 460.3022 481.0421 513.9678 550.9951 567.7649 625.6062 697.7927 710.1582 734.2510 774.6747 790.4701 874.2327 919.9856 951.2101 984.1264 990.1146 1038.2122 1040.7283 1047.5801 1078.8956 1123.5465 1131.2004 1171.9544 1195.9281 1207.3252 1277.0283 1291.9375 1364.4039 1389.4578 1401.1178 1419.6066 1434.4590 1460.9922 1475.3111 1480.8781 1485.5227 1489.8075 1576.7556 1582.6526 1607.9232 1635.2970 2966.9504 2981.0712 3043.3712 3059.9896 3091.0814 3106.1040 3122.3695 3132.6585 3145.7288 3164.5862 3540.0744 3699.7668
redmass: 3.3648 5.5924 1.1232 3.4435 1.4331 1.7892 3.1436 3.3193 3.3280 3.2515 6.1258 1.6052 2.8747 1.8611 2.9638 1.2165 4.4801 3.2916 5.7252 4.5680 9.0076 2.2683 1.6205 4.2356 1.3132 2.7304 1.3844 1.6106 1.3270 2.0290 2.0351 1.5640 2.4268 1.3813 1.4527 1.0619 3.1080 2.3912 1.5440 3.3597 8.5067 2.6711 1.2331 1.4206 1.9449 1.0641 1.3102 1.0886 1.7424 1.2265 1.4709 6.4545 5.8013 3.4850 1.0347 1.0379 1.1021 1.0956 1.0999 1.0980 1.0864 1.0886 1.0944 1.1009 1.0454 1.1037
irintensity: 1.0532 3.4334 0.7469 0.6750 1.3488 4.3905 0.3719 7.6003 10.2954 0.5501 10.2640 79.5664 3.2708 129.3084 14.9733 40.3891 3.7465 13.1170 5.7647 0.7340 21.6465 34.5833 37.4488 3.9361 0.1390 12.5682 0.2581 1.6408 0.0203 0.6975 13.4576 9.9978 57.3414 5.5265 8.6020 0.4406 21.6312 0.7308 2.5987 21.2370 3.2827 230.3158 13.1582 93.3007 12.4970 2.6670 16.1689 17.1274 40.4704 43.0956 252.9048 4.9515 18.8791 315.9855 65.4682 20.5444 35.3995 12.4239 19.1956 0.5589 6.2942 4.8193 26.7344 23.0886 26.0190 49.4982
temp: 298.150 k
press: 1.00000 atm
elementType: 8 7 7 6 6 6 6 6 6 6 6 6 1 1 1 1 1 1 1 1 1 1 1 1
symmnumber: 1
zpe: 514456.5 jmol-1
zpe.correction: 0.195946 hartree
zpe.thermalcorrener: 0.208241 hartree
zpe.thermalcorrenthalpy: 0.209185 hartree
zpe.thermalcorrgfe: 0.156984 hartree
zpe.sumelectzpe: -534.016446 hartree
zpe.sumelectthermal: -534.004151 hartree
zpe.sumelectthermalent: -534.003207 hartree
zpe.sumelectthermalfe: -534.055408 hartree
dipole: 4.2814 0.3295 -0.7011
dipole: 4.3509
quadrupole: -83.6115 -65.5522 -65.9490
quadrupole: -0.3408 -1.0278 -1.0566
quadrupole: -11.9072 6.1520 5.7552 -0.3408 -1.0278 -1.0566
hfenergy: -534.2123924 hartree
pointgroup: C01 [X(C9H12N2O1)]
dipole: -1.6791122 0.0999529 -0.3175105 debye
dipolederiv: -1.4008425 0.0417471 -0.0280652 0.0974594 -0.3930055 0.0436213 -0.0114222 0.0355031 -0.6149131 -1.0815737 0.0036962 0.2773913 -0.0152615 -0.346506 0.0196887 0.3227376 0.0327835 -0.894399 -0.3728742 -0.0430954 -0.2183434 -0.1052238 -0.669205 0.0697112 -0.0358552 0.0657397 -1.1284712 0.7892371 -0.0099636 0.0506294 0.0255783 0.077171 0.0351728 0.258799 0.0329911 -0.11447 -0.0607269 -0.1947334 -0.0382084 -0.1785171 0.2257272 0.0349867 -0.1056885 0.0430564 -0.0208038 -0.13442 0.0417048 0.0392084 0.0587734 -0.0174229 0.0452349 0.0665725 0.0416432 -0.095716 -0.0382756 0.1768045 0.0723019 0.0669554 -0.0379595 0.0610247 0.0301777 0.0710215 -0.1320343 -0.0246978 0.1735389 0.0425395 0.0984359 -0.0671786 -0.0173645 0.0312118 -0.0306409 0.0257035 -0.1105047 0.00532 0.1154643 0.0722184 0.2463953 -0.0329067 0.1220014 -0.0212267 0.538547 -0.0477392 -0.0921777 -0.0003422 -0.0705702 0.0356389 0.0338464 0.0036635 0.040334 -0.1529681 0.0842355 -0.0131805 0.0474107 0.0086593 -0.0105708 0.0385855 0.0472225 0.0376832 -0.1285863 1.9073802 -0.040829 -0.192332 -0.1462322 0.2864448 -0.185432 -0.4932812 -0.1777155 1.6629439 0.0438229 -0.081525 -0.0466555 -0.0733388 -0.0055721 -0.0521026 -0.0383672 -0.060252 0.1174733 0.0254977 -0.0593036 -0.0366798 -0.0949922 -0.0516825 -0.0712154 -0.046302 -0.0679371 0.1236777 0.0276628 0.0382142 0.096433 0.0242102 0.0645152 0.0295911 0.0991392 -0.0293647 -0.0174429 0.0399719 0.0551199 -0.0922135 0.0592212 0.0517216 -0.0058051 -0.0932436 0.0669074 -0.0334995 -0.0325236 -0.1665392 -0.0366344 -0.0659743 -0.0507901 -0.0273574 -0.0264375 -0.0337906 0.1021475 0.0844964 -0.1028325 0.066438 -0.0678623 -0.0907984 0.1307478 0.0243519 0.0500142 -0.039161 0.1146717 0.0777744 0.0634409 0.0449571 -0.0725904 -0.1337206 0.0389766 -0.0528328 -0.0660184 -0.0190962 0.0126861 -0.0979888 0.0155412 0.1256672 0.0085592 -0.0204611 -0.0038275 0.1543556 0.0236468 0.0849737 0.0027686 0.1034586 -0.0641969 -0.0453597 -0.0026253 -0.0472283 0.1468422 -0.1241517 0.0253951 -0.0453779 0.0175918 0.0898562 -0.0156458 -0.0504655 -0.0157418 0.1440447 0.1443376 0.0461847 -0.0352336 0.096571 0.3113363 0.004144 -0.0892447 -0.0001992 0.2007779 0.1624657 0.0210202 -0.0059511 0.0283413 0.3630051 0.0319953 -0.0314597 0.0230799 0.2219703 unknown
polarizability: 143.5190201|-7.4065057|103.8960187|5.1322099|9.5585974|83.7772545 unknown
InChI: InChI=1S/C9H12N2O/c1-7-5-3-4-6-8(7)11(2)9(10)12/h3-6H,10H2,1-2H3
charge 0 multiplicity 1
24 atoms
O  3.391871 -0.033187 -0.186833
N  1.16919 0.087988 0.572068
N  1.678261 0.290194 -1.730996
C  -0.246006 0.170057 0.289565
C  -0.957222 -0.982391 -0.16392
C  -0.923405 1.395496 0.506495
C  -2.349226 -0.852583 -0.404049
C  -0.244315 -2.302498 -0.385841
C  1.594754 -0.032642 1.978145
C  -2.311461 1.500669 0.269929
C  -3.025017 0.370448 -0.190974
C  2.152851 0.105658 -0.43339
H  -0.348014 2.260468 0.855611
H  -2.909754 -1.727851 -0.753826
H  0.441614 -2.246948 -1.252185
H  0.377354 -2.575877 0.48569
H  -0.96516 -3.117112 -0.569529
H  1.168051 -0.941143 2.444449
H  1.275766 0.847329 2.567731
H  2.694327 -0.100481 1.987252
H  -2.828216 2.451639 0.438731
H  -4.102203 0.439084 -0.379371
H  0.705686 0.50991 -1.936188
H  2.376574 0.330173 -2.468163
