program: Gaussian 09
title: 000088637
version: EM64L-G09RevD.01
frameworkgroup: C1[X(C16H14F2O2)]
method: RPBEPBE
basis: SDD
operation: Freq
keyword: #p
keyword: freq=noraman
keyword: PBEPBE/SDD
title: #p freq=noraman PBEPBE/SDD
converged: YES YES NO NO
title: Mulliken charges:
elementType: F F O O C C C C C C C C C C C C C C C C H H H H H H H H H H H H H H
charge: -0.204857 -0.206489 -0.414842 -0.231314 -0.361081 -0.423770 0.525845 0.466363 -0.497099 -0.352300 -0.362760 -0.431334 -0.393579 0.172627 -0.368169 -0.373894 -0.370418 -0.391454 0.312110 0.318006 0.220183 0.228654 0.226469 0.276475 0.243554 0.249934 0.241549 0.240606 0.259003 0.256057 0.255037 0.256670 0.255353 0.378868
chargesum: 0.00000
title: Mulliken charges with hydrogens summed into heavy atoms:
elementType: F F O O C C C C C C C C C C C C C C C C
charge: -0.204857 -0.206489 -0.035974 -0.231314 -0.140898 0.031353 0.525845 0.466363 0.022930 -0.102367 -0.121211 -0.190728 -0.134576 0.172627 -0.112112 -0.118857 -0.113748 -0.136102 0.312110 0.318006
polarizability: 1.99122620e+02 -1.57824098e+01 1.72663302e+02 -1.54866125e+01 1.52266764e+01 1.42982799e+02
1716.lowfreq: -7.8224 -0.0003 0.0002 0.0005 4.8037 6.7323 14.3350 23.5383 35.4758
frequency: 13.9504 23.4960 35.4630 39.3226 46.9262 62.1080 92.3146 136.3177 155.9033 179.7867 197.5979 221.4928 259.0398 320.6843 340.0158 376.8538 393.2668 411.4205 412.8773 425.0676 467.2887 482.7556 505.9116 524.0292 544.9831 567.1462 598.3256 627.0885 632.0192 640.1514 682.8495 723.1977 733.6994 769.2175 793.7626 812.1583 819.6960 820.4578 828.9943 844.6567 848.9535 891.2632 946.4922 949.3017 961.8050 962.4003 1001.6458 1006.2967 1008.0004 1026.5418 1069.7435 1087.3054 1103.3875 1112.8455 1155.1554 1158.0314 1159.2529 1189.3295 1197.8693 1204.9567 1208.5634 1234.7807 1260.4898 1273.0035 1294.5093 1299.1711 1314.9095 1328.9713 1374.4817 1378.3078 1385.6185 1405.2493 1408.2101 1439.5817 1469.1424 1490.9646 1496.7641 1598.9857 1601.6838 1609.0564 1612.9288 1665.7710 2964.6968 2991.0330 2999.9198 3037.7246 3065.7026 3125.6725 3132.0512 3137.1804 3152.6449 3172.5157 3173.0969 3175.0243 3176.4984 3514.1217
redmass: 4.3569 9.2042 8.0958 6.4506 4.4911 7.0937 3.0998 3.5852 7.5808 5.4840 3.8682 7.1866 6.0500 7.3060 6.6769 5.9599 5.1956 2.9556 3.0090 4.6020 4.4831 4.1090 1.8560 3.5013 2.7428 4.5862 4.1429 7.0750 6.1769 1.3752 3.2527 3.3208 3.3508 4.2565 2.4064 2.5515 1.2672 1.2600 2.2876 2.5934 1.8911 3.6162 1.3518 1.3987 1.3589 1.3588 2.8360 2.8440 2.2232 2.8703 2.6835 2.3584 1.3438 1.3983 1.4828 1.4873 1.3206 2.1588 2.0595 2.1067 2.9490 1.3409 1.5865 1.4395 1.2217 1.3004 1.3516 1.6520 2.4318 3.1604 5.3331 3.2610 2.6863 1.0858 1.1024 2.6094 2.5250 7.5567 7.4306 6.4278 6.3781 8.2036 1.0825 1.0611 1.0595 1.0984 1.1029 1.0901 1.0898 1.0895 1.0883 1.0951 1.0955 1.0958 1.0967 1.0639
irintensity: 0.4294 0.8885 0.1951 0.1791 0.1478 0.4826 0.1884 0.2858 0.2241 1.8826 2.5534 0.5567 0.5692 0.9276 0.2719 1.7499 0.1671 0.3141 0.5471 9.5661 18.6446 1.9189 42.5867 22.9457 72.3356 7.5808 7.1625 0.1162 1.7424 118.6924 6.8146 2.1059 16.4730 13.9978 6.3617 59.4107 1.8436 3.0331 61.2272 27.6343 14.7461 8.9652 0.1195 0.1506 0.0889 0.1207 25.2996 12.1192 8.5558 171.4452 74.1977 38.3618 8.3642 22.3741 66.3564 24.4568 6.4941 1.5617 33.6911 28.1902 25.4891 6.7964 0.6557 19.7421 3.2638 4.7449 2.5404 55.3988 25.8658 19.8802 0.3663 1.4999 3.1122 21.7317 10.8122 139.0030 89.9244 6.9000 4.9226 18.8650 11.1762 193.4403 15.2234 6.1774 23.0966 1.6974 30.1863 11.0902 8.8724 7.0878 6.8707 3.4684 5.0911 2.8664 2.1069 23.6887
temp: 298.150 k
press: 1.00000 atm
elementType: 9 9 8 8 6 6 6 6 6 6 6 6 6 6 6 6 6 6 6 6 1 1 1 1 1 1 1 1 1 1 1 1 1 1
symmnumber: 1
zpe: 679310.8 jmol-1
zpe.correction: 0.258736 hartree
zpe.thermalcorrener: 0.276803 hartree
zpe.thermalcorrenthalpy: 0.277747 hartree
zpe.thermalcorrgfe: 0.208622 hartree
zpe.sumelectzpe: -966.816196 hartree
zpe.sumelectthermal: -966.798129 hartree
zpe.sumelectthermalent: -966.797185 hartree
zpe.sumelectthermalfe: -966.866310 hartree
dipole: -1.7224 -0.9494 1.9407
dipole: 2.7630
quadrupole: -127.0667 -125.2711 -109.0211
quadrupole: 8.3215 -2.5243 1.3890
quadrupole: -6.6138 -4.8181 11.4319 8.3215 -2.5243 1.3890
hfenergy: -967.074932 hartree
pointgroup: C01 [X(C16H14F2O2)]
dipole: -0.6789465 0.4387924 -0.7267423 debye
polarizability: 200.6336685|14.2592567|169.8691424|15.8181985|16.1078582|144.2659106 unknown
InChI: InChI=1S/C16H14F2O2/c17-13-5-1-11(2-6-13)15(9-10-16(19)20)12-3-7-14(18)8-4-12/h1-8,15,19H,9-10H2
charge 0 multiplicity 1
34 atoms
F  -2.615857 -4.448649 0.526438
F  5.660803 0.184665 0.258362
O  -4.175335 3.229051 -0.151237
O  -2.462449 3.628999 1.363888
C  -0.015722 0.547235 -0.675183
C  -0.727668 1.715193 0.062668
C  -0.69065 -0.799058 -0.364692
C  1.496876 0.488616 -0.396125
C  -2.191953 1.88582 -0.37942
C  -0.540467 -1.406129 0.910422
C  2.301662 -0.372693 -1.190228
C  -1.499162 -1.446677 -1.332295
C  2.127216 1.243724 0.624943
C  -2.899199 2.989013 0.382039
C  -1.181515 -2.624102 1.219163
C  3.69169 -0.483027 -0.984595
C  -2.149397 -2.669981 -1.048568
C  3.520103 1.148118 0.853385
C  -1.974699 -3.228713 0.227374
C  4.270669 0.28549 0.040994
H  -0.138172 0.727328 -1.764261
H  -0.180538 2.657975 -0.12597
H  -0.702269 1.548409 1.155726
H  -2.764723 0.950327 -0.226646
H  -2.268065 2.110063 -1.461064
H  0.09721 -0.930834 1.664417
H  1.829977 -0.973135 -1.977091
H  -1.622992 -0.994876 -2.32399
H  1.542995 1.922017 1.2538
H  -1.070289 -3.102281 2.196788
H  4.315104 -1.142979 -1.594757
H  -2.773255 -3.177597 -1.789833
H  4.013287 1.728916 1.638309
H  -4.621915 3.944772 0.378137
