program: Gaussian 09
title: 000088634
version: EM64L-G09RevD.01
frameworkgroup: C1[X(C19H15NO2)]
method: RPBEPBE
basis: SDD
operation: Freq
keyword: #p
keyword: freq=noraman
keyword: PBEPBE/SDD
title: #p freq=noraman PBEPBE/SDD
converged: YES YES NO NO
title: Mulliken charges:
elementType: O O N C C C C C C C C C C C C C C C C C C C H H H H H H H H H H H H H H H
charge: -0.255518 -0.279527 -0.475855 0.135542 0.348327 0.430533 -0.380630 -0.342919 -0.469964 -0.429429 -0.659455 -0.238562 0.136615 -0.281641 -0.244931 0.180140 0.297191 -0.325504 -0.343622 -0.243884 -0.223860 -0.217263 0.308395 0.378262 0.238629 0.236446 0.277027 0.277514 0.237140 0.225902 0.227003 0.227571 0.254824 0.279823 0.237335 0.239049 0.239296
chargesum: 0.00000
title: Mulliken charges with hydrogens summed into heavy atoms:
elementType: O O N C C C C C C C C C C C C C C C C C C C
charge: -0.255518 -0.279527 -0.097592 0.135542 0.348327 0.430533 -0.072235 -0.104290 -0.233518 -0.192289 -0.104915 -0.012660 0.136615 -0.054638 -0.017360 0.180140 0.297191 -0.070680 -0.063799 -0.006549 0.015189 0.022033
polarizability: 3.42383418e+02 9.76264654e+00 2.63785925e+02 -2.26932794e-01 -8.93509377e-03 8.61867384e+01
1716.lowfreq: -5.8882 -0.0004 0.0006 0.0010 0.5623 6.0158 16.6914 30.5532 44.8387
frequency: 16.4346 30.5229 44.7888 51.7398 79.7235 83.8301 131.9899 147.6618 166.8637 179.8662 180.0227 259.9266 282.9868 312.6620 367.3517 397.1894 403.1263 424.8704 425.7691 441.7834 473.2594 497.4071 511.7406 513.4367 552.6351 572.3993 612.9567 633.0583 641.7886 653.7635 668.5341 694.8245 742.6707 768.3459 772.5725 783.2808 786.6893 809.9204 811.1474 860.1260 864.9243 866.3231 890.6157 917.0726 930.0675 935.1924 961.4409 967.7702 989.0238 989.7725 994.5873 994.6345 995.4635 1014.3901 1026.8712 1032.9478 1059.0323 1089.5076 1091.9760 1152.9985 1176.2029 1183.3685 1188.3975 1193.2878 1201.3049 1207.9318 1234.6340 1236.7687 1283.6883 1296.7284 1313.4374 1329.6922 1370.1063 1390.2262 1405.8257 1408.5156 1420.8602 1437.1590 1448.6263 1455.1871 1481.0751 1511.4931 1540.2785 1566.1707 1590.6313 1592.1486 1596.7487 1609.9032 1626.8231 1646.8945 2992.5323 3038.8751 3120.9918 3126.4278 3129.1566 3134.1474 3143.8462 3143.9968 3151.6986 3154.3488 3162.1426 3163.6663 3173.6643 3192.4305 3286.2511
redmass: 4.3247 4.5787 7.2104 5.8065 3.9990 3.4772 5.6874 4.6111 4.2714 4.1564 5.9939 8.2636 3.8302 6.9824 9.4001 2.9008 2.8850 3.1014 4.8424 7.6479 3.3682 7.1862 6.9674 2.6330 6.4609 3.0621 6.4465 4.3748 6.3915 3.4557 6.2522 1.8118 1.3573 5.4693 1.7072 5.4465 1.9450 1.3818 6.0418 1.2609 3.7328 1.9078 1.4113 7.2887 1.4216 1.5568 1.5043 1.6361 1.3302 6.1689 1.6447 2.5490 1.3896 1.3488 2.2522 2.5813 2.4286 1.7356 2.0154 1.4087 1.0762 1.1384 1.3319 1.1580 1.1235 2.2018 1.9221 2.2468 1.8755 2.5221 1.6848 1.7061 2.4935 8.8722 1.1867 2.5110 4.9792 2.2812 2.5814 2.2641 2.2028 3.2691 4.3875 3.5355 6.2517 6.7478 6.0189 5.8900 5.6954 2.7718 1.0614 1.0955 1.0856 1.0869 1.0880 1.0855 1.0884 1.0948 1.0968 1.0925 1.1006 1.0962 1.1013 1.0945 1.0803
irintensity: 0.2082 1.0730 4.2383 1.0720 0.3314 11.6639 0.0944 0.1321 0.9824 3.2349 7.8613 2.1089 1.1045 15.6529 11.5753 0.1182 0.0166 10.4855 0.2656 1.7722 0.2284 23.0139 0.1513 0.6374 34.5024 10.9051 0.2396 3.4868 26.0954 0.0447 3.0523 51.4434 3.9831 0.1282 46.7710 0.5225 84.3077 29.7961 1.6194 3.7326 16.8140 66.3120 4.8705 6.4463 0.4336 31.9936 2.5144 12.0392 4.7668 2.3915 13.6738 26.8070 0.6204 0.0204 3.3548 13.4013 14.4960 6.4913 8.4734 1.6987 7.0349 2.9971 16.0438 34.2944 3.1428 41.3999 39.5457 65.6879 1.3584 39.7944 58.1409 108.4506 13.5641 6.1954 86.5601 2.3971 37.5098 37.3990 8.6276 0.2721 15.3864 197.1902 639.4697 296.6311 5.6540 7.4908 48.7389 7.9557 100.8161 78.1721 17.6384 0.5664 1.2052 2.6498 3.9998 0.0642 8.3319 21.2324 41.4908 12.5199 32.1338 14.6707 23.3760 5.5158 478.0353
temp: 298.150 k
press: 1.00000 atm
elementType: 8 8 7 6 6 6 6 6 6 6 6 6 6 6 6 6 6 6 6 6 6 6 1 1 1 1 1 1 1 1 1 1 1 1 1 1 1
symmnumber: 1
zpe: 757311.3 jmol-1
zpe.correction: 0.288445 hartree
zpe.thermalcorrener: 0.306315 hartree
zpe.thermalcorrenthalpy: 0.307259 hartree
zpe.thermalcorrgfe: 0.240122 hartree
zpe.sumelectzpe: -936.742886 hartree
zpe.sumelectthermal: -936.725016 hartree
zpe.sumelectthermalent: -936.724072 hartree
zpe.sumelectthermalfe: -936.791209 hartree
dipole: -5.0753 2.2985 0.0133
dipole: 5.5716
quadrupole: -87.1838 -126.9974 -134.6083
quadrupole: 2.3615 -0.0545 -0.1358
quadrupole: 29.0794 -10.7342 -18.3451 2.3615 -0.0545 -0.1358
hfenergy: -937.0313308 hartree
pointgroup: C01 [X(C19H15N1O2)]
dipole: 1.9876135 0.9180133 -0.1078527 debye
polarizability: 342.061106|-6.6536856|256.0568144|12.6810405|-35.8218562|94.2381614 unknown
InChI: InChI=1S/C19H15NO2/c21-18(15-8-2-1-3-9-15)13-19(22)20-17-12-6-10-14-7-4-5-11-16(14)17/h1-12,20H,13H2
charge 0 multiplicity 1
37 atoms
O  -0.078686 -3.036242 0.76321
O  1.357486 0.936248 -0.015976
N  -0.685075 -0.809309 0.263613
C  -2.825084 0.352987 -0.066908
C  -2.104261 -0.874256 0.226167
C  -4.274035 0.304684 -0.110578
C  -2.805279 -2.069994 0.460456
C  -2.180507 1.612651 -0.316561
C  -4.956395 -0.932241 0.133279
C  -5.007386 1.50337 -0.398929
C  1.714173 -1.44254 0.484773
C  -4.229781 -2.089296 0.412075
C  0.21497 -1.825942 0.514423
C  -2.924933 2.762819 -0.594597
C  -4.352307 2.71192 -0.637322
C  2.180065 -0.00936 0.219494
C  3.649229 0.272987 0.239464
C  4.620962 -0.737657 0.482471
C  4.080329 1.608777 0.005284
C  5.993672 -0.415295 0.49059
C  5.451153 1.92815 0.014813
C  6.411849 0.916114 0.257692
H  -2.242988 -2.979185 0.678585
H  -0.229187 0.103138 0.086529
H  -1.089277 1.7051 -0.29571
H  -6.051687 -0.950766 0.096856
H  2.129375 -1.778332 1.455171
H  2.181598 -2.110087 -0.266302
H  -6.102372 1.450004 -0.428175
H  -4.749144 -3.035538 0.598896
H  -2.409206 3.71115 -0.781317
H  -4.924343 3.620098 -0.856332
H  4.316447 -1.773252 0.664811
H  3.318969 2.373237 -0.180097
H  6.736805 -1.197544 0.677756
H  5.774588 2.958745 -0.165343
H  7.479164 1.163356 0.265341
