program: Gaussian 09
title: 000008011
version: EM64L-G09RevD.01
frameworkgroup: C1[X(C3H5NO)]
method: RPBEPBE
basis: SDD
operation: Freq
keyword: #pfreq=noraman
keyword: PBEPBE/SDD
title: #p freq=noraman PBEPBE/SDD
converged: YES YES NO NO
title: Mulliken charges:
elementType: O N C C C H H H H H
charge: -0.418695 -0.012778 -0.297399 -0.452092 -0.097201 0.205744 0.237755 0.247287 0.248843 0.338535
chargesum: 0.00000
title: Mulliken charges with hydrogens summed into heavy atoms:
elementType: O N C C C
charge: -0.080160 -0.012778 0.146100 0.044038 -0.097201
polarizability: 4.56077195e+01 6.66108074e+00 3.75203933e+01 2.33828224e+00 4.46108396e-01 3.19046137e+01
1716.lowfreq: 0.0011 0.0012 0.0014 4.5410 7.1168 21.2274 106.9306 190.9349 327.8277
frequency: 106.9047 190.9331 327.8169 359.9570 377.5586 569.7559 813.5993 843.5031 986.6521 1018.9936 1042.3155 1147.9217 1230.3963 1319.5869 1338.3054 1381.1517 1438.6645 1470.9871 2206.0048 2968.1743 2991.0896 3043.3374 3101.6300 3561.6604
redmass: 4.0950 2.8098 1.1512 6.1272 2.6168 3.3932 3.4613 2.1401 2.2180 1.8130 3.9136 1.1432 1.1612 1.3487 1.2675 1.2006 1.0865 1.0786 12.4285 1.0681 1.0603 1.1002 1.0962 1.0664
irintensity: 1.2620 8.0539 155.6964 16.1125 0.1224 20.2196 2.0376 9.9386 65.7015 22.3058 26.6331 23.4055 5.1686 3.7277 7.8404 15.7420 16.9148 4.2739 7.6868 61.5641 23.2577 7.8130 19.7233 6.4331
temp: 298.150 k
press: 1.00000 atm
elementType: 8 7 6 6 6 1 1 1 1 1
symmnumber: 1
zpe: 202389.6 jmol-1
zpe.correction: 0.077086 hartree
zpe.thermalcorrener: 0.082783 hartree
zpe.thermalcorrenthalpy: 0.083727 hartree
zpe.thermalcorrgfe: 0.048224 hartree
zpe.sumelectzpe: -246.864823 hartree
zpe.sumelectthermal: -246.859127 hartree
zpe.sumelectthermalent: -246.858183 hartree
zpe.sumelectthermalfe: -246.893685 hartree
dipole: 3.0919 3.7861 1.6288
dipole: 5.1524
quadrupole: -38.1229 -30.8048 -26.2737
quadrupole: -0.8838 1.9100 -1.6887
quadrupole: -6.3891 0.9290 5.4601 -0.8838 1.9100 -1.6887
hfenergy: -246.9419093 hartree
pointgroup: C01 [X(C3H5N1O1)]
dipole: -1.28744 1.4376995 -0.6202782 debye
dipolederiv: -0.6943262 -0.1209523 0.0404483 -0.2122887 -0.6260023 -0.2145317 0.0152019 -0.2592695 -0.2309702 -0.2941257 -0.0111093 0.0054144 0.0441162 -0.212418 -0.0087946 -0.0255037 -0.0074504 -0.231495 0.5836734 0.1444377 0.0143628 0.2147451 0.5862616 0.1654972 -0.0361439 0.1847907 0.3366979 -0.1193688 -0.0324158 0.0197927 -0.0359263 0.0570826 0.0085976 0.0914252 0.0562665 0.1856042 0.103918 -0.0772948 0.0409748 -0.1414202 -0.0220514 -0.0054776 0.0781408 0.0000449 -0.0606136 -0.1431353 0.1183564 -0.0052547 0.0984521 -0.1386096 -0.0332779 -0.0284833 0.0143147 0.0689784 0.0801959 -0.0303005 -0.0410568 -0.0261051 0.0512529 0.030541 -0.0064127 -0.0116209 -0.1044746 0.0326232 -0.032414 -0.0241257 -0.0053702 -0.0547682 -0.0583561 -0.0136169 -0.0863922 0.0976172 0.034952 0.0307081 -0.0262667 0.0300109 0.1128287 -0.0022425 -0.0269067 0.044413 -0.0848235 0.4155936 0.0109844 -0.0242891 0.0337861 0.2464236 0.1180445 -0.0477007 0.0649031 0.0234792 unknown
polarizability: 46.2500826|-6.2221163|36.7946906|2.4585203|-0.2782555|31.9879533 unknown
InChI: InChI=1S/C3H5NO/c4-2-1-3-5/h5H,1,3H2
charge 0 multiplicity 1
10 atoms
O  -1.686993 -0.980932 -0.19056
N  2.103871 -0.466192 0.143958
C  -1.377308 0.334376 0.360384
C  -0.10271 0.973886 -0.256614
C  1.115373 0.175863 -0.03874
H  -2.218957 1.046539 0.226793
H  -1.229739 0.158124 1.437135
H  0.049281 1.976298 0.190164
H  -0.241131 1.124522 -1.345325
H  -1.869888 -0.906785 -1.161395
