program: Gaussian 09
title: 000088600
version: EM64L-G09RevD.01
frameworkgroup: C1[X(C6H8O4)]
method: RPBEPBE
basis: SDD
operation: Freq
keyword: #p
keyword: freq=noraman
keyword: PBEPBE/SDD
title: #p freq=noraman PBEPBE/SDD
converged: YES YES NO NO
title: Mulliken charges:
elementType: O O O O C C C C C C H H H H H H H H
charge: -0.263903 -0.177851 -0.149919 -0.191919 -0.555894 0.225112 0.120159 -0.752723 0.184517 -0.496880 0.294256 0.245833 0.276404 0.242234 0.257133 0.254077 0.240727 0.248638
chargesum: 0.00000
title: Mulliken charges with hydrogens summed into heavy atoms:
elementType: O O O O C C C C C C
charge: -0.263903 -0.177851 -0.149919 -0.191919 -0.015805 0.225112 0.120159 0.023048 0.184517 0.246561
polarizability: 9.42717157e+01 -2.05970094e+00 8.39045163e+01 -4.68013012e-01 -2.91007687e-01 5.86833109e+01
1716.lowfreq: -0.0003 0.0002 0.0004 5.0716 5.5566 9.9259 25.7364 29.7597 53.7259
frequency: 25.4888 29.7140 53.6831 98.6100 140.1532 142.3837 161.8178 186.4140 287.7757 338.6895 399.9207 410.1005 472.2778 502.5414 549.3279 621.1919 727.6607 769.8058 811.2448 900.5559 921.8790 988.6451 1017.6167 1055.4986 1112.1100 1123.6213 1149.2961 1178.4894 1212.0419 1263.5804 1377.0861 1419.5654 1435.2890 1447.7508 1452.1976 1452.7153 1459.4261 1605.0829 1636.0533 1653.2872 2983.2568 3010.7801 3034.8732 3067.0805 3116.1351 3126.8214 3141.7882 3161.4445
redmass: 4.7343 8.0483 4.8191 1.0760 4.3187 1.0894 4.0907 3.8210 4.1978 6.1369 3.8381 3.5673 5.2270 3.4460 4.5332 3.6363 6.0575 5.0972 4.5897 1.8480 7.1174 2.2723 1.9051 2.8128 1.2701 2.0925 1.4512 4.0911 1.5503 1.6469 1.2417 1.1679 1.0885 1.0599 1.0659 1.0493 1.0505 10.6084 10.5491 8.3116 1.0378 1.0293 1.0607 1.0949 1.1050 1.1011 1.1023 1.1053
irintensity: 4.7890 0.4567 6.8932 0.1673 1.2985 0.4846 4.3141 7.5627 7.1784 2.7175 3.7567 1.1828 13.7861 0.1557 6.6813 38.8069 16.2693 19.7267 0.2948 10.5489 6.2053 20.5654 40.0533 157.6801 0.4648 151.3775 26.4101 213.2845 48.0728 56.3613 71.7627 6.4548 26.0756 27.5723 18.3460 15.5065 11.9077 240.5895 140.2746 63.7768 2.5950 20.0806 3.7922 3.7735 18.0797 7.2007 0.1988 11.1294
temp: 298.150 k
press: 1.00000 atm
elementType: 8 8 8 8 6 6 6 6 6 6 1 1 1 1 1 1 1 1
symmnumber: 1
zpe: 348309.3 jmol-1
zpe.correction: 0.132664 hartree
zpe.thermalcorrener: 0.144213 hartree
zpe.thermalcorrenthalpy: 0.145158 hartree
zpe.thermalcorrgfe: 0.092933 hartree
zpe.sumelectzpe: -533.536125 hartree
zpe.sumelectthermal: -533.524576 hartree
zpe.sumelectthermalent: -533.523632 hartree
zpe.sumelectthermalfe: -533.575856 hartree
dipole: 0.2640 -1.7441 2.5091
dipole: 3.0671
quadrupole: -44.4241 -70.5118 -58.2505
quadrupole: -9.4828 0.2305 0.0936
quadrupole: 13.3047 -12.7830 -0.5217 -9.4828 0.2305 0.0936
hfenergy: -533.6687892 hartree
pointgroup: C01 [X(C6H8O4)]
dipole: 0.2572075 -1.176185 0.0808575 debye
dipolederiv: -0.9176697 0.2649314 0.2867724 0.335759 -0.7943141 -0.1998115 0.3521397 -0.2060483 -0.4261121 -0.5019442 0.066957 0.0454095 0.1104472 -0.3103573 -0.0852955 -0.2520262 -0.2377447 -0.9777376 -0.4506999 0.061526 0.2228293 -0.2150512 -0.5841082 -0.3416156 -0.030432 -0.2551173 -0.6316724 -0.5680486 -0.2734387 -0.0014931 0.0606221 -0.83017 -0.1460821 0.1258464 0.047708 -0.3105383 -0.8277639 -0.3121687 -0.4973298 -0.2186208 -0.2563329 -0.1774421 -0.4739245 -0.1759873 -0.3630937 1.2137823 -0.1593603 0.1882474 -0.4608149 0.1189005 0.0343137 0.5147278 0.3125167 1.2608299 0.7660646 0.225515 -0.2181238 0.6950445 0.8128534 0.6124378 0.018013 0.3500492 0.6087216 -0.4271474 0.1346234 0.1428152 0.1379618 -0.023571 -0.0709627 0.1354354 -0.1045487 -0.1606291 0.7966677 0.0016477 -0.0898328 -0.4551075 1.2910626 0.2996845 -0.3045686 0.16503 0.3493957 0.5268185 -0.1074013 -0.1231677 -0.0592526 0.2297585 0.0195053 -0.1330508 0.0442379 0.3273112 0.0901309 0.0785267 0.0091538 0.0729313 0.0627664 -0.0207076 0.0217471 -0.0286327 0.0801823 0.0787334 -0.0297514 0.0969069 -0.0259158 0.0713609 0.0219006 0.0971277 0.0552034 0.0300936 0.132207 -0.0555231 -0.0447168 0.0172227 0.0593291 -0.0646895 -0.0277463 -0.0601264 0.0736514 0.0616859 -0.0292213 0.0373853 -0.0649764 -0.0055353 0.0764275 0.0336832 0.0730797 0.0952748 0.0186253 0.0460227 -0.0609392 0.0744022 0.0919258 0.0413767 -0.0935714 0.0636117 0.0002237 0.0020543 0.0584679 -0.0125982 -0.0038581 0.0396982 0.1141643 0.0317454 0.0581246 -0.0313541 0.0582232 0.0295232 0.0325969 0.0765734 -0.0582213 -0.0630523 0.048981 -0.0449636 0.0954532 -0.0517192 -0.0008764 -0.0139154 -0.0773668 0.0849547 -0.0501516 -0.0641268 -0.0563923 -0.0200001 unknown
polarizability: 93.9372168|2.5555685|69.0990929|-3.8957331|11.9953524|73.8232332 unknown
InChI: InChI=1S/C6H8O4/c1-4(7)3-5(8)6(9)10-2/h3H2,1-2H3
charge 0 multiplicity 1
18 atoms
O  1.907905 -0.948454 -0.113346
O  -1.662587 -1.292394 -1.646883
O  -0.536123 0.644255 1.905865
O  1.788952 1.339433 0.340309
C  -0.765416 -1.427352 0.625497
C  -1.856806 -1.06648 -0.429064
C  -0.049829 -0.155703 1.070491
C  -3.123938 -0.440003 0.121539
C  1.301629 0.19351 0.398138
C  3.223521 -0.738577 -0.774821
H  -0.060968 -2.139535 0.175346
H  -1.267754 -1.857632 1.509789
H  -2.883088 0.321267 0.885357
H  -3.727133 -1.219808 0.62646
H  -3.721846 0.000407 -0.690762
H  3.102983 -0.060033 -1.635179
H  3.538111 -1.740228 -1.096202
H  3.938188 -0.300871 -0.058135
