program: Gaussian 09
title: 000088572
version: EM64L-G09RevD.01
frameworkgroup: C1[X(C18H18N2O2)]
method: RPBEPBE
basis: SDD
operation: Freq
keyword: #p
keyword: freq=noraman
keyword: PBEPBE/SDD
title: #p freq=noraman PBEPBE/SDD
converged: YES YES NO NO
title: Mulliken charges:
elementType: O O N N C C C C C C C C C C C C C C C C C C H H H H H H H H H H H H H H H H H H
charge: -0.305293 -0.433464 -0.122129 -0.165814 0.149801 -0.005183 0.229606 -0.409732 0.313392 0.333389 -0.623447 -0.317642 -0.396937 -0.384168 -0.400209 -0.386117 -0.235523 -0.234624 -0.238862 -0.239751 -0.252633 -0.248144 0.252976 0.213709 0.254582 0.262098 0.212408 0.253945 0.196527 0.262018 0.251173 0.260560 0.260762 0.227640 0.224860 0.227053 0.224055 0.228239 0.227111 0.333767
chargesum: 0.00000
title: Mulliken charges with hydrogens summed into heavy atoms:
elementType: O O N N C C C C C C C C C C C C C C C C C C
charge: -0.305293 -0.099697 -0.122129 -0.165814 0.149801 -0.005183 0.229606 0.056952 0.313392 0.333389 0.105642 0.132830 -0.134919 -0.132995 -0.139648 -0.125355 -0.007883 -0.009763 -0.011808 -0.015697 -0.024394 -0.021034
polarizability: 2.98784358e+02 1.12075630e+01 2.92275313e+02 -1.74529813e+01 -1.76326418e+01 1.20165209e+02
1716.lowfreq: -6.5409 -1.6865 -0.0006 -0.0003 0.0004 1.9841 24.1418 28.4185 34.5969
frequency: 24.0172 28.2864 34.5301 47.7889 68.2640 73.1905 82.6776 100.8627 131.0168 135.7501 143.1155 192.0436 204.0386 239.8418 258.8184 276.8626 292.4531 305.5353 349.4214 369.3347 401.5737 408.0719 409.4450 456.8540 490.0131 515.9708 525.7247 595.0880 614.4376 615.5007 626.9155 663.5279 665.4457 690.5376 696.7398 702.4690 708.8507 768.6288 776.4883 828.2230 848.2009 858.7785 867.4152 916.7003 921.0937 929.2555 932.2998 975.3961 976.9445 983.7832 986.2849 988.8305 990.8303 993.8015 997.1147 1020.2337 1028.3434 1033.3392 1045.3765 1077.5775 1082.0546 1107.0258 1121.7800 1126.8303 1171.6803 1172.7294 1181.3186 1188.9835 1194.5877 1206.8242 1229.8586 1296.5598 1317.1861 1320.8609 1322.6721 1341.1457 1357.3859 1365.1910 1376.1410 1377.5226 1380.8197 1434.3424 1434.9086 1438.1702 1440.2192 1461.0089 1466.0811 1468.1603 1491.0348 1495.0063 1569.9528 1579.4295 1586.2080 1612.2881 1614.2534 1642.6580 2960.1943 2980.3244 2987.9381 3061.5045 3063.2290 3101.5140 3112.5583 3123.2711 3125.4576 3133.3145 3135.0006 3148.1854 3152.0693 3158.6576 3161.4210 3168.4794 3170.1197 3557.2926
redmass: 5.3752 3.7982 4.6620 4.4733 4.9428 2.8234 3.5831 1.3381 2.9336 4.6617 3.4599 5.4954 3.6388 5.4106 4.0006 4.9562 4.4370 1.3750 2.5534 5.8612 2.8372 2.9853 3.0676 3.6385 3.5176 3.3719 3.5880 3.8195 6.2934 6.3745 6.6242 7.2228 7.5451 7.2324 1.8170 1.9730 4.8977 1.8206 1.9871 3.4688 1.2508 1.2601 3.8705 2.5491 1.5222 2.4985 2.3456 2.6787 1.4307 1.4179 5.7602 6.2338 4.9146 1.4208 1.3238 1.8763 1.9377 2.0278 3.3463 1.7777 1.6925 1.7726 1.4718 1.7454 1.0573 1.0570 2.2873 1.1216 1.1518 2.2005 3.5566 1.7786 1.4400 1.6728 1.4555 1.9732 2.9308 1.2511 4.8935 1.6655 3.6032 1.2799 2.0908 2.1048 1.1398 1.0813 1.1792 1.7947 1.1818 2.2288 6.6599 6.2125 6.8372 6.0727 6.0362 7.5433 1.0689 1.0362 1.0620 1.0997 1.1013 1.0957 1.0998 1.0846 1.0847 1.0885 1.0888 1.0933 1.0932 1.0962 1.0953 1.0999 1.1004 1.0662
irintensity: 0.5409 0.7023 0.6808 0.2333 3.0371 1.4425 0.5300 0.9195 5.4522 3.6474 6.2348 2.9105 1.5740 0.1083 7.4159 7.8045 0.6688 168.1992 17.4036 0.1977 0.3328 3.0323 7.4648 12.6032 1.3732 12.8283 21.0071 3.2974 0.9044 0.0252 8.4958 16.1140 8.6979 4.3424 90.0483 22.9351 2.8335 76.9002 32.0599 7.4971 1.7807 0.4339 47.4830 5.6786 12.3835 13.9473 13.9345 111.0289 4.0435 0.5154 3.8780 4.3157 24.0071 3.2333 1.2926 20.5418 10.8300 5.3920 8.3907 18.3686 1.1031 3.7898 10.3278 84.0686 0.0639 0.0797 4.4982 4.0344 0.7269 25.0877 34.2734 63.2732 1.5131 2.5731 2.0554 97.2545 16.8917 7.6483 2.0244 4.7958 14.4696 58.8035 5.5059 1.1816 18.8927 3.4734 43.6862 4.5234 6.9699 46.2905 16.8599 23.9448 16.4656 45.5898 50.4493 813.4928 57.5977 54.8609 103.9234 8.2117 26.3452 21.8900 11.3251 1.6683 2.6760 9.8056 9.1036 41.9204 27.3084 16.1101 18.6105 22.1501 12.2115 4.8547
temp: 298.150 k
press: 1.00000 atm
elementType: 8 8 7 7 6 6 6 6 6 6 6 6 6 6 6 6 6 6 6 6 6 6 1 1 1 1 1 1 1 1 1 1 1 1 1 1 1 1 1 1
symmnumber: 1
zpe: 838363.1 jmol-1
zpe.correction: 0.319316 hartree
zpe.thermalcorrener: 0.339430 hartree
zpe.thermalcorrenthalpy: 0.340374 hartree
zpe.thermalcorrgfe: 0.268164 hartree
zpe.sumelectzpe: -955.072613 hartree
zpe.sumelectthermal: -955.052499 hartree
zpe.sumelectthermalent: -955.051555 hartree
zpe.sumelectthermalfe: -955.123766 hartree
dipole: 2.5014 -0.5440 -1.5588
dipole: 2.9971
quadrupole: -97.1403 -118.0706 -135.9707
quadrupole: -1.9942 -12.1755 -2.6215
quadrupole: 19.9202 -1.0101 -18.9102 -1.9942 -12.1755 -2.6215
hfenergy: -955.3919291 hartree
pointgroup: C01 [X(C18H18N2O2)]
dipole: -0.9693291 0.1654336 -0.6507086 debye
polarizability: 294.7068347|8.9977554|290.9058349|24.7772597|31.4037076|125.61221 unknown
InChI: InChI=1S/C18H18N2O2/c1-20(12-13-21)18-19-16(14-8-4-2-5-9-14)17(22-18)15-10-6-3-7-11-15/h2-11,21H,12-13H2,1H3
charge 0 multiplicity 1
40 atoms
O  -1.092791 1.374842 -0.18868
O  -5.575653 -0.375555 1.083425
N  -3.249551 0.516462 -0.726601
N  -1.280921 -0.893588 -0.510619
C  0.228496 0.797537 -0.043777
C  0.078746 -0.58136 -0.221063
C  -1.923721 0.278109 -0.484202
C  -4.116261 -0.656194 -0.944173
C  1.30329 1.767127 0.155373
C  1.045889 -1.68871 -0.092651
C  -3.841986 1.846879 -0.504943
C  -4.665737 -1.2774 0.356384
C  2.641949 1.491062 -0.250243
C  1.01681 3.042307 0.725794
C  2.171756 -1.62075 0.773674
C  0.812663 -2.89197 -0.814151
C  3.658975 2.448941 -0.065482
C  2.037954 3.998198 0.901623
C  3.054092 -2.715155 0.890463
C  1.69865 -3.983358 -0.698779
C  3.366995 3.707056 0.514082
C  2.827464 -3.899769 0.149975
H  -3.521811 -1.422705 -1.473597
H  -4.951839 -0.345437 -1.602755
H  -3.078879 2.623806 -0.667501
H  -4.253973 1.943329 0.516637
H  -4.660542 1.998294 -1.231342
H  -3.838114 -1.474055 1.055472
H  -5.165049 -2.241694 0.119479
H  2.878245 0.535863 -0.729149
H  -0.00968 3.271736 1.028486
H  2.34238 -0.721699 1.374881
H  -0.073557 -2.953373 -1.453317
H  4.680548 2.218062 -0.388022
H  1.797125 4.971198 1.34464
H  3.912391 -2.647903 1.568566
H  1.507346 -4.900819 -1.266952
H  4.160209 4.449788 0.65313
H  3.514685 -4.748298 0.241944
H  -6.402395 -0.253904 0.551068
