program: Gaussian 09
title: 000088527
version: EM64L-G09RevD.01
frameworkgroup: C1[X(C6H12O5S)]
method: RPBEPBE
basis: SDD
operation: Freq
keyword: #p
keyword: freq=noraman
keyword: PBEPBE/SDD
title: #p freq=noraman PBEPBE/SDD
converged: YES YES NO NO
title: Mulliken charges:
elementType: S O O O O O C C C C C C H H H H H H H H H H H H
charge: -0.060689 -0.478092 -0.467968 -0.464392 -0.432403 -0.198057 -0.067492 -0.067413 -0.565945 -0.135481 -0.319836 -0.057563 0.280739 0.223632 0.321023 0.218247 0.261956 0.203162 0.358257 0.375767 0.198279 0.154491 0.371762 0.348014
chargesum: 0.00000
title: Mulliken charges with hydrogens summed into heavy atoms:
elementType: S O O O O O C C C C C C
charge: 0.093802 -0.119834 -0.092201 -0.092631 -0.084389 -0.198057 0.213248 0.156219 -0.244922 0.082766 0.145282 0.140716
polarizability: 1.24360616e+02 1.39340187e+00 8.53507089e+01 4.25081503e+00 3.49789003e+00 8.51415220e+01
1716.lowfreq: -13.9434 -0.0013 -0.0011 0.0029 7.4638 14.8675 42.9766 48.7305 72.5448
frequency: 42.9301 48.6895 72.5219 110.8559 116.3820 132.2302 179.2673 201.3866 242.4587 253.2750 270.1128 293.5440 297.0447 312.7492 373.3360 415.6003 446.0852 452.8619 470.3936 475.4078 508.8544 633.7358 650.0569 682.6383 706.6528 803.3956 807.8018 871.4819 898.0998 955.0436 963.8700 967.8122 1013.2687 1036.3272 1060.4329 1084.3268 1109.6539 1143.4317 1198.5046 1208.4376 1224.0117 1239.8451 1281.1151 1295.2377 1318.1484 1322.4504 1338.8175 1344.8429 1364.0716 1372.4963 1380.0063 1382.2720 1459.1177 1627.9256 2375.7684 2937.4118 2953.6014 2966.1295 2971.9521 3013.9919 3048.9541 3101.6414 3421.0623 3468.2807 3519.2217 3556.6370
redmass: 5.8575 6.7583 6.4662 6.0664 3.7125 4.3929 4.6817 6.8532 5.2620 3.2701 2.6285 3.1943 2.8592 2.4826 4.0240 1.2879 2.8392 1.2302 2.1615 1.1859 1.2406 3.7361 3.8605 3.3290 3.8192 1.2590 3.9952 3.2363 2.2923 2.4603 2.6032 2.5952 2.9832 4.1616 2.3298 2.6628 2.3882 1.2966 1.1332 1.5888 1.2521 1.2203 1.2054 1.2257 1.2366 1.2400 1.1950 1.2726 1.3529 1.2641 1.3898 1.5750 1.0747 8.5630 1.0371 1.0804 1.0821 1.0722 1.0872 1.0852 1.0862 1.0952 1.0646 1.0651 1.0649 1.0663
irintensity: 4.7405 1.0522 2.1664 3.7425 0.5738 0.2534 7.5010 8.1373 9.7544 21.2131 38.7505 14.1846 24.5231 10.5996 3.1735 35.4906 58.5420 127.9395 65.8443 106.5703 196.3621 22.8280 6.9608 17.2199 17.1943 21.2278 58.6699 8.4640 23.0066 35.8303 110.1786 5.9562 9.5800 75.0814 15.4174 37.3011 31.0636 14.9883 93.5999 13.1402 41.4634 16.9068 7.8326 12.1991 73.9075 28.9681 47.8219 2.4020 21.1075 5.0304 28.6585 30.6338 3.6978 130.1087 12.0760 4.9876 43.6320 19.6014 124.5438 21.5606 8.2922 8.0790 50.7999 37.1001 31.7693 12.2223
temp: 298.150 k
press: 1.00000 atm
elementType: 16 8 8 8 8 8 6 6 6 6 6 6 1 1 1 1 1 1 1 1 1 1 1 1
symmnumber: 1
zpe: 477285.9 jmol-1
zpe.correction: 0.181789 hartree
zpe.thermalcorrener: 0.196141 hartree
zpe.thermalcorrenthalpy: 0.197085 hartree
zpe.thermalcorrgfe: 0.140291 hartree
zpe.sumelectzpe: -1008.978774 hartree
zpe.sumelectthermal: -1008.964422 hartree
zpe.sumelectthermalent: -1008.963477 hartree
zpe.sumelectthermalfe: -1009.020271 hartree
dipole: 1.5973 -2.2060 -2.0152
dipole: 3.3881
quadrupole: -96.1205 -72.8899 -82.8877
quadrupole: 1.0071 5.3184 1.7825
quadrupole: -12.1545 11.0762 1.0783 1.0071 5.3184 1.7825
hfenergy: -1009.1605627 hartree
pointgroup: C01 [X(C6H12O5S1)]
dipole: -0.7002769 0.9205788 -0.6625492 debye
dipolederiv: -0.3123684 -0.0313792 0.096619 -0.0473172 -0.2056178 -0.085918 0.1059506 -0.0618647 -0.240129 -0.6595549 0.0128624 -0.0965469 -0.0297715 -0.7345648 -0.1339866 -0.0925739 -0.1525069 -0.4363811 -0.5991322 0.1980927 0.1478574 0.188134 -0.6927172 -0.0537582 0.1692027 -0.0560971 -0.540649 -0.3976298 -0.0949049 -0.0083348 -0.1283871 -0.5058661 -0.033952 -0.1508359 -0.0316526 -0.7023641 -0.545404 0.3145795 0.0743048 0.3658564 -0.6166456 0.2260877 0.0588723 0.2192539 -0.4312524 -0.9219497 -0.1072994 -0.0688254 0.0087637 -0.2830889 0.0261408 -0.2182827 -0.0201532 -0.5116453 0.3455562 0.130074 0.1418254 -0.0421517 0.3845949 0.1641738 0.0819714 0.0850937 0.2202931 0.4369673 -0.1548536 -0.0705599 -0.0781729 0.4979205 -0.05561 0.0840043 0.0358402 0.3088968 0.2593071 0.2622238 -0.1538292 0.1343267 -0.0363702 -0.0207635 -0.1658867 0.0134593 0.0462624 -0.2672112 -0.1027993 0.16895 0.0590547 0.3197883 -0.0626286 0.2213658 -0.0141957 0.4577836 0.3441604 -0.2732618 0.0537788 -0.2222444 0.3829156 0.0148223 -0.0259253 -0.0651345 0.241681 1.2188807 0.1269235 0.0715589 0.0242896 0.1646107 -0.010425 0.0009525 -0.0491346 0.6138982 0.0384371 0.0113444 -0.0332894 0.0464277 -0.006153 0.0395599 -0.0466821 0.0170409 -0.0592653 -0.0258143 0.0492401 -0.0587361 0.0413419 -0.0618714 0.0582943 -0.0824582 0.0941 -0.1211658 0.0267763 -0.0672051 0.0086525 -0.0944232 -0.0528146 -0.0323611 -0.0068221 -0.0065953 -0.0027098 0.0532745 0.1064575 -0.0574066 0.0763883 -0.087733 0.0692095 -0.0133604 0.0418796 -0.0215915 0.0554387 -0.0172399 -0.0309881 -0.016646 0.032429 -0.1048213 -0.0049302 -0.0526735 0.0249596 -0.1005738 -0.0497482 0.086225 -0.1167626 -0.0264817 0.0851244 0.1174015 0.0681537 -0.0044435 0.2499559 -0.1467951 0.0177804 -0.0845713 0.4108867 0.0425177 0.0477315 0.0858559 0.2429321 0.3045383 -0.1230927 -0.1029885 -0.0998327 0.2675717 -0.0178593 -0.1037937 -0.0171205 0.3612959 0.0260713 0.0015351 0.000569 -0.0039404 0.1005996 0.0360376 0.0448925 0.0504999 -0.2023433 0.0276472 0.0340709 0.0082139 0.0652587 0.1724965 -0.0146994 -0.0083179 -0.0241043 0.1589786 0.2244456 0.0467036 -0.1190549 0.0498321 0.3242256 0.0000267 0.0315141 0.0034262 0.3754268 0.2181816 -0.1255284 -0.0757756 -0.0954528 0.2518852 -0.1352118 -0.0439903 -0.1633702 0.2215319 unknown
polarizability: 123.4982865|2.535085|86.1121736|-6.712119|-3.7095436|85.2423866 unknown
InChI: InChI=1S/C6H12O5S/c7-1-3(9)5(10)6(11)4(12)2-8/h1,3-6,8-12H,2H2
charge 0 multiplicity 1
24 atoms
S  -2.998108 -0.658168 1.430052
O  -1.078252 -1.894701 -0.697325
O  1.620211 -1.489107 -0.813634
O  1.532403 0.545394 1.562422
O  -3.332422 1.760557 -0.465403
O  3.931983 0.685623 0.342467
C  -0.522839 -0.83893 0.170811
C  0.713946 -0.355447 -0.615014
C  -1.576233 0.243115 0.502554
C  1.516685 0.738455 0.126229
C  -2.134438 0.954234 -0.747476
C  2.946888 0.77749 -0.4270
H  -0.15985 -1.273644 1.122893
H  0.389089 0.036332 -1.603994
H  -1.140034 0.960615 1.218942
H  1.046713 1.723827 -0.089796
H  -2.461249 0.209962 -1.490455
H  -1.343918 1.590134 -1.199002
H  -1.905298 -2.234745 -0.258156
H  1.059111 -2.264656 -1.082918
H  3.059151 0.895723 -1.52722
H  -3.980782 0.159121 0.881768
H  2.482705 0.379117 1.824625
H  -3.087962 2.532199 0.10703
