program: Gaussian 09
title: 000088577
version: EM64L-G09RevD.01
frameworkgroup: C1[X(C20H21N3O)]
method: RPBEPBE
basis: SDD
operation: Freq
keyword: #p
keyword: freq=noraman
keyword: PBEPBE/SDD
title: #p freq=noraman PBEPBE/SDD
converged: YES YES NO NO
title: Mulliken charges:
elementType: O N N N C C C C C C C C C C C C C C C C C C C C H H H H H H H H H H H H H H H H H H H H H
charge: -0.311986 -0.134190 -0.069945 -0.167418 -0.374474 -0.368482 -0.368424 -0.367025 0.203931 -0.614808 0.149971 -0.004188 0.312933 0.332312 -0.397614 -0.384816 -0.400328 -0.385850 -0.235180 -0.234936 -0.239598 -0.239920 -0.253391 -0.248426 0.222781 0.256896 0.243465 0.223337 0.193850 0.217700 0.216834 0.193300 0.225428 0.225968 0.191225 0.262231 0.248874 0.260280 0.262736 0.227416 0.224199 0.226562 0.224017 0.227995 0.226755
chargesum: 0.00000
title: Mulliken charges with hydrogens summed into heavy atoms:
elementType: O N N N C C C C C C C C C C C C C C C C C C C C
charge: -0.311986 -0.134190 -0.069945 -0.167418 0.105203 0.098321 0.043127 0.043108 0.203931 0.027814 0.149971 -0.004188 0.312933 0.332312 -0.135383 -0.135942 -0.140049 -0.123114 -0.007763 -0.010737 -0.013036 -0.015903 -0.025396 -0.021671
polarizability: 3.39940641e+02 -1.14185044e+01 3.18083644e+02 -1.04454017e+01 -1.39819220e+01 1.36268413e+02
1716.lowfreq: -13.0177 -5.3894 0.0007 0.0008 0.0010 4.1356 15.7584 31.7709 33.6989
frequency: 13.9179 31.5077 33.6022 46.6117 62.9438 72.2776 79.7207 134.9471 146.0692 153.0987 196.4930 218.0453 226.6950 237.8015 240.3921 281.1471 286.8753 296.6281 344.2124 365.3151 390.0948 401.5507 408.5074 412.0324 453.1908 472.6474 488.8583 523.5906 551.2848 611.4475 614.4437 618.6777 644.5839 661.1101 664.0398 687.2443 696.5657 702.6290 708.7699 745.5012 767.8341 775.9418 841.2139 847.6148 858.8177 862.3533 919.1991 924.6370 929.0305 932.9306 957.8482 976.3821 984.1137 986.0380 988.7384 990.9596 993.2861 997.4617 1004.8732 1025.8412 1032.8962 1050.1908 1055.0710 1063.2678 1077.6533 1081.5362 1082.1567 1120.5646 1128.6825 1146.6832 1168.2778 1171.6232 1172.5102 1189.6286 1193.3347 1202.3272 1208.0911 1237.7425 1257.3877 1285.7299 1290.6904 1318.4827 1322.4827 1332.1682 1338.0561 1355.6838 1360.1963 1371.3925 1375.7907 1377.6635 1383.0335 1431.5337 1434.6090 1438.0000 1455.3935 1461.6535 1462.5443 1466.9775 1468.2356 1474.9996 1481.6658 1494.1519 1569.6021 1578.7132 1586.0897 1611.5824 1614.1479 1646.2591 2849.2827 2854.2070 2871.6771 2967.0648 2971.7264 3022.6982 3034.6504 3038.8287 3080.4331 3094.8618 3098.8625 3122.8195 3124.3585 3133.0126 3133.8168 3148.4326 3151.3240 3158.3172 3160.6861 3168.2922 3169.3503
redmass: 4.1368 3.4831 3.7430 4.5128 3.9087 5.0957 4.2970 6.8423 3.4517 3.7174 5.3561 1.6083 2.8365 2.2360 5.3979 2.4254 4.2404 3.0012 2.4084 5.0968 2.4417 2.8451 2.9126 4.1243 5.7399 2.7262 3.6333 3.8389 3.3451 5.9451 6.4071 6.5261 2.8018 7.9005 6.9034 7.1371 1.8249 1.9954 4.5584 3.3069 1.8272 1.9663 1.5776 1.2508 1.3915 4.5808 1.5004 2.1200 3.1046 1.9250 3.7522 1.3840 1.4106 6.0421 6.2901 4.6997 1.4251 1.3328 2.5192 2.3694 2.0395 1.7607 2.1876 1.7646 1.7489 1.7063 1.6854 2.8052 1.8624 2.5323 2.4721 1.0553 1.0627 1.1189 1.1424 1.1218 3.1050 3.4791 2.5263 1.5330 1.5128 1.4420 1.3664 1.8216 1.2782 1.6748 2.1955 1.4349 5.6341 2.8495 2.7278 1.1692 2.3813 2.3604 1.0783 1.0722 1.0780 1.7627 1.2321 1.1024 1.0528 2.7219 6.7416 6.3452 6.9239 6.0697 6.0747 9.1737 1.0706 1.0654 1.0607 1.0685 1.0681 1.0737 1.0883 1.0905 1.1010 1.0946 1.0942 1.0846 1.0847 1.0885 1.0888 1.0933 1.0932 1.0961 1.0952 1.0999 1.1002
irintensity: 0.2250 0.5526 0.1369 0.2787 0.2850 1.5139 0.0311 0.9359 4.7944 0.5442 0.8250 0.6248 1.4824 1.9849 0.1920 1.2588 2.7830 9.9704 0.1793 2.5042 0.4227 0.5214 0.4806 2.3695 6.1222 0.1312 2.2799 10.9425 1.0671 5.5388 0.3712 5.2187 7.4242 11.6576 14.8993 6.9774 83.6109 24.3598 1.6315 6.4630 74.7324 34.2891 0.5179 1.5740 4.3821 37.3473 8.9363 2.8159 19.1648 10.0043 21.6752 1.5798 2.2871 5.5841 5.7879 31.6945 4.6010 2.5594 77.3312 6.3221 4.1345 8.0655 8.3213 18.7133 15.6669 1.2508 0.8576 4.2628 15.5876 42.4206 13.7262 0.1304 0.2122 4.2825 1.0951 5.2771 59.0230 12.3270 52.2675 46.4613 11.9765 2.7528 0.1621 185.5298 7.3754 14.2501 1.5475 0.4275 0.8630 0.9061 5.8341 2.2543 14.2944 8.1957 0.1466 62.4438 9.1662 26.5821 19.7105 12.9173 8.5247 46.5831 18.0502 27.2569 15.8497 60.5262 45.3202 1049.9978 46.2011 47.9197 206.0765 36.7207 83.8292 48.7892 45.2440 61.9041 31.0774 5.1968 6.8618 1.4532 3.0341 10.9418 9.0470 44.5475 27.1640 15.5023 18.0694 25.1239 9.8503
temp: 298.150 k
press: 1.00000 atm
elementType: 8 7 7 7 6 6 6 6 6 6 6 6 6 6 6 6 6 6 6 6 6 6 6 6 1 1 1 1 1 1 1 1 1 1 1 1 1 1 1 1 1 1 1 1 1
symmnumber: 1
zpe: 964621.0 jmol-1
zpe.correction: 0.367405 hartree
zpe.thermalcorrener: 0.388093 hartree
zpe.thermalcorrenthalpy: 0.389037 hartree
zpe.thermalcorrgfe: 0.315617 hartree
zpe.sumelectzpe: -1012.466484 hartree
zpe.sumelectthermal: -1012.445795 hartree
zpe.sumelectthermalent: -1012.444851 hartree
zpe.sumelectthermalfe: -1012.518272 hartree
dipole: 2.6280 0.9194 0.6432
dipole: 2.8575
quadrupole: -115.4284 -131.0322 -144.8365
quadrupole: 0.2054 2.2631 -4.6101
quadrupole: 15.0039 -0.5998 -14.4041 0.2054 2.2631 -4.6101
hfenergy: -1012.8338884 hartree
pointgroup: C01 [X(C20H21N3O1)]
dipole: -1.0341561 0.3611445 -0.2529623 debye
polarizability: 339.806398|11.8584011|313.9744007|-2.7071746|32.3116286|140.5118991 unknown
InChI: InChI=1S/C20H21N3O/c1-22-12-14-23(15-13-22)20-21-18(16-8-4-2-5-9-16)19(24-20)17-10-6-3-7-11-17/h2-11H,12-15H2,1H3
charge 0 multiplicity 1
45 atoms
O  -0.69545 1.002738 0.395695
N  -2.732785 -0.218902 0.3343
N  -5.532397 -0.175383 -0.198954
N  -0.554323 -1.26849 0.064859
C  -3.48664 -1.4881 0.300765
C  -3.513792 0.99002 0.655729
C  -4.713869 -1.339504 -0.617241
C  -4.74181 1.076654 -0.270659
C  -1.369525 -0.228557 0.259698
C  -6.803083 -0.08184 -0.943906
C  0.705429 0.665716 0.243899
C  0.761081 -0.721194 0.072599
C  1.613485 1.809976 0.227072
C  1.910477 -1.641343 -0.026931
C  2.860424 1.764544 -0.463154
C  1.240968 3.025916 0.873142
C  3.165544 -1.35898 0.579858
C  1.741986 -2.883857 -0.698276
C  3.711657 2.887479 -0.480549
C  2.094508 4.147401 0.846098
C  4.229294 -2.280876 0.489664
C  2.808455 -3.802363 -0.790216
C  3.338691 4.085255 0.175464
C  4.060043 -3.504212 -0.201624
H  -3.8272 -1.743094 1.325381
H  -2.812372 -2.282585 -0.0565
H  -2.874165 1.877927 0.532788
H  -3.8584 0.941316 1.709568
H  -4.368329 -1.240662 -1.678479
H  -5.332094 -2.253242 -0.54374
H  -5.379595 1.919504 0.054492
H  -4.396007 1.288547 -1.315381
H  -7.40521 0.755442 -0.548103
H  -7.382101 -1.01255 -0.807311
H  -6.662999 0.080952 -2.04242
H  3.150135 0.857281 -1.00221
H  0.279971 3.078568 1.394399
H  3.300924 -0.430198 1.143622
H  0.763633 -3.112744 -1.131995
H  4.663761 2.832216 -1.020459
H  1.790057 5.070923 1.351608
H  5.187229 -2.050068 0.969485
H  2.663042 -4.752682 -1.316402
H  4.002541 4.956524 0.156688
H  4.888207 -4.218475 -0.270561
