program: Gaussian 09
title: 000088517
version: EM64L-G09RevD.01
frameworkgroup: C1[X(C6H2I2O2)]
method: RPBEPBE
basis: SDD
operation: Freq
keyword: #pfreq=noraman
keyword: PBEPBE/SDD
title: #p freq=noraman PBEPBE/SDD
converged: YES YES YES YES
title: Mulliken charges:
elementType: I I O O C C C C C C H H
charge: 0.221276 0.221278 -0.131735 -0.186130 0.424805 -0.431060 -0.431063 -0.231567 -0.231569 0.198595 0.288584 0.288584
chargesum: 0.00000
title: Mulliken charges with hydrogens summed into heavy atoms:
elementType: I I O O C C C C C C
charge: 0.221276 0.221278 -0.131735 -0.186130 0.424805 -0.431060 -0.431063 0.057018 0.057015 0.198595
polarizability: 1.78047079e+02 -1.04958603e-02 1.59759192e+02 -4.55128885e-03 5.68844324e-04 3.38387172e+01
1716.lowfreq: -5.0703 -0.0004 0.0003 0.0003 4.7836 6.1443 49.5863 92.7811 124.5732
frequency: 49.5787 92.7811 124.5723 149.3404 189.5732 208.0649 237.7406 298.5706 417.2778 432.8264 449.0780 579.2420 634.6925 651.8782 760.5327 799.3334 835.0466 868.4317 917.5465 949.2970 1094.6225 1253.3514 1256.4885 1280.5622 1535.9101 1557.9854 1575.8402 1595.8490 3173.9039 3175.8734
redmass: 16.9417 37.5222 10.3775 4.6073 13.2415 19.1422 15.1276 6.0083 8.7442 5.5891 12.8486 6.5966 3.6100 9.9911 6.7583 8.5730 7.0536 1.3214 1.5982 4.1881 3.1418 9.8205 1.4372 1.6248 10.1150 9.3067 12.9428 8.2487 1.0936 1.0946
irintensity: 2.4593 0.1916 5.9824 0.0000 0.1745 0.2834 0.7470 5.7838 45.5484 0.0000 0.0740 6.8789 0.3378 78.1820 1.4269 20.7264 4.5765 0.0000 43.4899 122.6758 0.0436 304.3674 15.3656 2.1622 118.5556 253.5715 139.3310 69.8787 0.2969 0.1652
temp: 298.150 k
press: 1.00000 atm
elementType: 53 53 8 8 6 6 6 6 6 6 1 1
symmnumber: 1
zpe: 162367.9 jmol-1
zpe.correction: 0.061843 hartree
zpe.thermalcorrener: 0.071401 hartree
zpe.thermalcorrenthalpy: 0.072345 hartree
zpe.thermalcorrgfe: 0.022982 hartree
zpe.sumelectzpe: -402.552135 hartree
zpe.sumelectthermal: -402.542576 hartree
zpe.sumelectthermalent: -402.541632 hartree
zpe.sumelectthermalfe: -402.590995 hartree
dipole: 0.0000 0.2373 0.0001
dipole: 0.2373
quadrupole: -73.7427 -99.8177 -85.8592
quadrupole: 0.0000 -0.0003 0.0008
quadrupole: 12.7305 -13.3445 0.6140 0.0000 -0.0003 0.0008
hfenergy: -402.6139772 hartree
pointgroup: C01 [X(C6H2I2O2)]
dipole: 0.0000194 -0.0933414 -0.0000532 debye
dipolederiv: -0.520706 -0.3122018 -0.0000566 -0.3400796 -0.081913 -0.0000329 -0.0000211 0.0000985 0.0911733 -0.5210738 0.3119694 -0.0000232 0.3392751 -0.0813174 0.0000042 -0.0001022 0.0001074 0.0911431 -0.4324646 0.0001521 -0.0000067 0.000271 -0.6885198 0.0000605 -0.0000833 0.0000163 -0.2723887 -0.6752757 0.0001841 -0.0000001 0.0001838 -1.1351487 -0.0000681 -0.0000005 0.0000479 -0.3182666 0.4112625 -0.0003136 0.0000212 -0.0000982 0.769239 -0.0001103 0.0000331 -0.0000315 0.3279539 0.6597077 0.767043 0.0000667 0.9513492 0.3083768 0.0001415 0.0000213 -0.0000606 -0.2055399 0.6607155 -0.7667946 0.0000276 -0.9506664 0.3073554 0.000029 0.0002008 -0.0001551 -0.2055002 -0.6760531 -0.5615834 -0.0000401 -0.712665 -0.3797248 -0.0000715 -0.0001575 -0.0000259 -0.0289995 -0.677008 0.5612833 -0.0000352 0.7123422 -0.3788876 -0.0000134 -0.0000142 0.0000317 -0.0290266 1.7725197 0.0004838 0.0000451 -0.0000169 1.2017836 0.0000468 0.0000612 0.0000034 0.2353288 -0.0008694 0.0131957 -0.0000037 0.0409338 0.0794477 0.0000072 0.0000166 -0.0000085 0.1570571 -0.0007547 -0.0134178 0.000005 -0.0408292 0.0793088 0.0000069 0.0000459 -0.0000237 0.1570652 unknown
polarizability: 178.047071|0.0159514|159.7591996|0.0045511|0.0005702|33.8387172 unknown
InChI: InChI=1S/C6H2I2O2/c7-4-1-3(9)2-5(8)6(4)10/h1-2H
charge 0 multiplicity 1
12 atoms
I  3.09104 1.443913 0.000167
I  -3.091892 1.442068 0.000014
O  -0.000711 2.388519 -0.000035
O  0.000929 -3.080659 0.000069
C  -0.000335 1.130567 -0.000051
C  1.276687 0.324416 0.000048
C  -1.276877 0.323649 -0.000015
C  1.274574 -1.042275 0.000039
C  -1.273944 -1.043042 -0.000028
C  0.000545 -1.80891 -0.000089
H  2.192984 -1.636466 0.000099
H  -2.191999 -1.637782 -0.000019
