program: Gaussian 09
title: 000088529
version: EM64L-G09RevD.01
frameworkgroup: C1[X(C13H12O3)]
method: RPBEPBE
basis: SDD
operation: Freq
keyword: #pfreq=noraman
keyword: PBEPBE/SDD
title: #p freq=noraman PBEPBE/SDD
converged: YES YES NO NO
title: Mulliken charges:
elementType: O O O C C C C C C C C C C C C C H H H H H H H H H H H H
charge: -0.235584 -0.277848 -0.250776 -0.686917 0.400212 0.490711 -0.476644 0.225170 -0.377322 -0.430162 -0.252383 -0.217629 -0.220529 -0.245252 0.129125 -0.498206 0.231616 0.244359 0.284786 0.251632 0.227830 0.285175 0.226313 0.226263 0.229190 0.232011 0.242778 0.242079
chargesum: 0.00000
title: Mulliken charges with hydrogens summed into heavy atoms:
elementType: O O O C C C C C C C C C C C C C
charge: -0.235584 -0.277848 -0.250776 -0.210942 0.400212 0.490711 -0.191859 0.225170 -0.125691 -0.202331 0.032792 0.008684 0.005735 -0.016061 0.129125 0.218663
polarizability: 1.89098163e+02 -6.25336392e+00 1.38580771e+02 4.65153923e+00 1.60426989e+01 1.08134835e+02
1716.lowfreq: -15.2166 -6.9361 0.0005 0.0009 0.0010 0.9940 11.8440 20.9690 45.7242
frequency: 9.8003 20.4359 45.6162 78.0963 92.2364 108.3919 110.9983 174.9190 222.3019 251.1711 290.9545 308.7401 327.4045 383.5435 403.2526 457.6729 487.2934 554.9382 588.0115 613.5901 637.8167 697.5554 711.7462 719.9721 738.8173 771.7940 794.7988 807.7794 847.4938 853.7024 862.4467 887.0879 910.2232 944.3865 976.6331 977.3769 990.4065 995.9454 1026.9397 1064.0477 1077.5541 1106.3443 1113.1410 1124.1360 1148.5868 1160.4748 1172.5063 1190.8830 1203.3628 1221.8689 1273.3143 1299.4271 1334.8655 1370.0583 1382.9736 1424.4296 1440.0777 1449.8966 1451.6076 1463.6273 1483.3162 1534.7867 1594.2410 1602.2069 1613.6028 1638.1097 2991.5634 3003.3261 3061.1778 3104.0495 3117.0734 3125.3005 3137.4360 3147.6471 3147.9148 3163.9790 3244.3510 3267.4178
redmass: 3.9493 4.9047 5.7314 3.5512 1.3802 3.9862 3.0571 4.5377 4.9599 4.9846 3.5660 8.1595 2.3846 5.3312 2.8152 3.4642 4.9658 5.2832 3.6541 6.2115 5.0566 3.5447 1.7818 2.8527 4.0942 2.8159 1.9479 2.7343 2.9415 1.2502 1.5659 6.7012 1.7384 1.9422 1.9247 2.6615 6.1388 1.3202 2.2793 4.3870 1.7368 2.2548 1.2652 1.7104 1.4948 1.9650 1.0547 1.1620 2.4081 1.4486 2.2377 1.6276 1.2911 5.3791 7.1072 1.2360 2.0550 1.1366 1.0498 1.0514 2.1996 6.5029 6.1902 7.3110 6.1090 10.5635 1.0630 1.0297 1.0974 1.1044 1.0866 1.0864 1.0917 1.0963 1.1045 1.1016 1.0991 1.1008
irintensity: 0.1748 0.4622 0.6673 0.4775 1.1955 0.5511 0.7533 2.6314 2.4680 2.4385 8.0434 6.5567 10.2292 0.8436 0.1780 2.4885 13.5084 9.3220 2.0569 0.1578 0.6234 3.3666 56.8140 66.7529 30.2751 9.7039 4.4392 7.6359 7.1799 0.6703 28.8786 14.9594 2.0345 7.7570 16.4321 41.1716 0.2421 0.8379 8.5742 188.2280 17.9288 36.0255 0.0426 16.6105 36.8082 110.4388 0.1733 0.7466 3.5475 19.7087 81.6248 6.0920 0.5963 21.6134 2.9492 12.7129 6.3264 20.7010 14.4152 12.5190 20.6334 115.9774 0.6366 20.9276 8.4065 254.9139 17.3495 38.7125 7.1429 27.2018 7.6702 0.1189 16.9794 30.7264 20.0581 22.9354 3.4600 4.2169
temp: 298.150 k
press: 1.00000 atm
elementType: 8 8 8 6 6 6 6 6 6 6 6 6 6 6 6 6 1 1 1 1 1 1 1 1 1 1 1 1
symmnumber: 1
zpe: 569021.5 jmol-1
zpe.correction: 0.216729 hartree
zpe.thermalcorrener: 0.231336 hartree
zpe.thermalcorrenthalpy: 0.232280 hartree
zpe.thermalcorrgfe: 0.171349 hartree
zpe.sumelectzpe: -727.090779 hartree
zpe.sumelectthermal: -727.076173 hartree
zpe.sumelectthermalent: -727.075228 hartree
zpe.sumelectthermalfe: -727.136159 hartree
dipole: -1.0593 1.9941 0.9490
dipole: 2.4493
quadrupole: -89.1955 -86.5234 -90.4707
quadrupole: 7.1670 4.0613 1.8409
quadrupole: -0.4656 2.2064 -1.7408 7.1670 4.0613 1.8409
hfenergy: -727.3075083 hartree
pointgroup: C01 [X(C13H12O3)]
dipole: 0.3999957 -0.7053677 0.5206132 debye
polarizability: 189.0158505|-7.3882635|131.7595553|-2.4690542|-20.6075781|115.038364 unknown
InChI: InChI=1S/C13H12O3/c1-15-13(14)11-8-12(16-9-11)7-10-5-3-2-4-6-10/h2-6,8-9H,7H2,1H3
charge 0 multiplicity 1
28 atoms
O  -0.291419 1.800921 0.168978
O  -3.781486 -1.215931 0.135596
O  -4.29475 0.68983 -1.116902
C  1.294046 0.488256 1.568239
C  -0.049885 0.604168 0.911002
C  2.413764 0.003053 0.638345
C  -1.162914 -0.207673 0.81729
C  -2.140211 0.484665 -0.0054
C  2.733239 0.71529 -0.546337
C  3.156458 -1.15976 0.958403
C  -1.570061 1.695607 -0.376765
C  3.774786 0.27168 -1.390665
C  4.200285 -1.605435 0.114464
C  4.512764 -0.890351 -1.063592
C  -3.487687 0.046845 -0.399484
C  -5.12034 -1.74868 -0.206629
H  1.198091 -0.205395 2.422064
H  1.565026 1.47664 1.988671
H  -1.29557 -1.188403 1.266697
H  2.162736 1.614276 -0.806957
H  2.919373 -1.720086 1.871547
H  -1.924282 2.529369 -0.975339
H  4.011108 0.831318 -2.302867
H  4.765568 -2.507148 0.376081
H  5.320508 -1.233919 -1.719428
H  -5.167358 -2.728943 0.287984
H  -5.224608 -1.849025 -1.300203
H  -5.908583 -1.074769 0.169504
