program: Gaussian 09
title: 000088585
version: EM64L-G09RevD.01
frameworkgroup: C1[X(C21H19N3O4)]
method: RPBEPBE
basis: SDD
operation: Freq
keyword: #p
keyword: freq=noraman
keyword: PBEPBE/SDD
title: #p freq=noraman PBEPBE/SDD
converged: YES YES NO NO
title: Mulliken charges:
elementType: O O O O N N N C C C C C C C C C C C C C C C C C C C C C H H H H H H H H H H H H H H H H H H H
charge: -0.198721 -0.201772 -0.199017 -0.199458 -0.087516 -0.215067 -0.219404 -0.372946 -0.377026 -0.370168 -0.357138 -0.633058 0.092385 0.084666 0.085230 0.086111 0.183494 0.176846 0.179763 0.182482 -0.353422 -0.353679 -0.354264 -0.354240 -0.211370 -0.210653 -0.211242 -0.211195 0.220753 0.251436 0.221365 0.232194 0.251819 0.240746 0.252128 0.254846 0.234012 0.199368 0.228473 0.270413 0.269231 0.269722 0.269610 0.238767 0.238453 0.238529 0.238510
chargesum: 0.00000
title: Mulliken charges with hydrogens summed into heavy atoms:
elementType: O O O O N N N C C C C C C C C C C C C C C C C C C C C C
charge: -0.198721 -0.201772 -0.199017 -0.199458 -0.087516 -0.215067 -0.219404 0.099243 0.076533 0.122398 0.149836 0.028795 0.092385 0.084666 0.085230 0.086111 0.183494 0.176846 0.179763 0.182482 -0.083009 -0.084448 -0.084542 -0.084630 0.027397 0.027800 0.027288 0.027315
polarizability: 3.53548086e+02 -1.00795352e+01 2.70005113e+02 -2.95151402e+01 9.30032129e+00 1.63770066e+02
1716.lowfreq: -8.3012 -4.5632 -0.0002 0.0004 0.0008 4.0510 6.8265 9.9386 16.5441
frequency: 5.4135 9.7464 16.4970 23.8365 36.0455 43.8402 48.0898 100.6522 130.5081 136.5426 137.5423 138.1099 168.4431 173.5228 180.6247 197.3441 219.6353 229.3999 239.3741 260.3447 270.7823 292.2506 314.5844 337.1814 338.0717 383.9826 408.0097 414.5405 430.9726 442.0484 455.5186 455.6398 522.6464 523.1341 525.9153 550.4875 598.8617 612.1818 658.7771 658.8075 676.9129 677.3329 698.9722 701.4120 712.7540 717.2756 767.7040 771.8150 785.2782 785.4059 794.9479 795.8589 843.0774 854.4365 854.8847 906.4054 906.7134 954.8381 955.5404 974.2826 974.4277 993.0419 994.7494 1005.9062 1005.9959 1014.8666 1014.9412 1026.3247 1041.6338 1060.2164 1072.0761 1072.4017 1084.0680 1098.0626 1137.1151 1167.1109 1167.4684 1170.6929 1171.0072 1202.7668 1202.9913 1210.3408 1232.7611 1278.8580 1282.5771 1284.0605 1292.6624 1317.8951 1320.5687 1329.4702 1329.7081 1350.1789 1350.9642 1381.4709 1385.7559 1415.7025 1415.8685 1437.6859 1446.0009 1447.4863 1453.2924 1453.3243 1454.9703 1456.0612 1471.2437 1478.9661 1484.1575 1487.1158 1614.5594 1614.8008 1617.2466 1617.8895 1626.6108 1628.2543 1675.7239 1676.2880 2876.0462 2889.7747 2900.4799 3028.5459 3030.4025 3032.8293 3042.9528 3048.6810 3086.1428 3101.7088 3102.1677 3139.0283 3139.0916 3152.8492 3152.9819 3164.4815 3164.8983 3174.3696 3174.4993
redmass: 6.4704 7.0573 7.8121 5.5676 5.4159 4.1211 5.8152 3.0348 3.6730 5.7459 5.0054 5.1460 3.1793 4.3121 6.3682 1.5781 2.0980 4.2129 5.0953 3.2877 3.5491 5.0943 4.5968 8.3882 8.0609 3.3194 2.9926 3.0796 3.1463 3.1785 4.8925 4.8858 7.2037 7.1915 6.7823 6.6708 10.2551 7.6829 4.7980 4.8012 5.0831 5.2011 5.8862 5.0049 3.1007 3.1876 1.4100 1.4427 5.0930 4.9564 1.6524 1.6771 4.6256 4.0109 4.3151 1.3895 1.3879 6.7330 6.7209 1.4130 1.4125 2.8581 2.8866 1.3462 1.3454 2.0981 2.0600 2.4423 3.8184 2.5865 2.6166 2.6345 2.4275 1.4395 1.7592 1.2161 1.2083 2.0065 2.0101 2.9047 2.9312 2.7993 2.1432 1.4092 1.4897 1.4786 1.5457 1.3295 1.2245 1.6261 2.0774 2.4848 2.8110 1.3269 1.3676 6.0294 5.9282 1.1416 1.2638 1.3072 2.4615 2.4648 2.0908 2.0536 1.0457 1.0788 1.0818 1.0755 7.7035 7.7017 8.3333 8.2002 10.7675 11.1820 11.7654 11.7950 1.0568 1.0699 1.0694 1.0619 1.0698 1.0645 1.0882 1.0890 1.1009 1.1055 1.1057 1.0864 1.0864 1.0906 1.0906 1.0956 1.0956 1.1004 1.1003
irintensity: 0.2646 0.2483 0.0541 0.1856 0.1501 2.6522 1.4152 2.3635 6.2841 4.2653 0.0688 0.7005 0.1859 0.7498 0.4254 0.2451 0.9474 0.2023 0.4956 2.0314 3.6352 9.6856 14.0477 10.5233 7.3016 14.6507 1.0131 0.4345 1.4443 5.2946 0.0289 0.0023 8.3089 8.4331 8.1962 9.2435 7.1222 40.2502 0.0396 0.0201 0.3526 0.3775 5.1874 9.2540 125.6442 27.5340 5.6052 2.6079 0.0554 0.0736 49.2350 12.8996 14.6735 13.4284 11.2480 0.0121 0.0102 10.4865 8.6908 2.1652 2.0726 58.2657 43.0663 0.0186 0.0110 0.5340 0.1064 27.3796 3.0506 62.7377 21.0763 14.3002 83.9606 19.0373 13.7984 10.8504 7.4783 5.0766 5.6057 24.3374 10.5963 2.5230 7.6562 28.4818 0.2038 7.3024 14.2513 8.4095 6.3886 61.0661 215.8142 258.3888 107.9598 54.0636 26.7692 16.4727 6.2610 1.8778 14.4838 20.3896 11.2504 11.4032 5.2079 8.0488 20.5969 8.3943 8.7139 11.9514 3.8644 2.6212 148.0352 118.5242 318.9802 316.9435 49.7596 38.9129 90.7433 59.2185 100.0013 17.8846 7.2411 46.1434 11.2396 15.3998 38.2369 4.7382 4.8554 1.8309 1.8140 5.8383 6.0345 6.0817 6.0632 24.0919 19.9002
temp: 298.150 k
press: 1.00000 atm
elementType: 8 8 8 8 7 7 7 6 6 6 6 6 6 6 6 6 6 6 6 6 6 6 6 6 6 6 6 6 1 1 1 1 1 1 1 1 1 1 1 1 1 1 1 1 1 1 1
symmnumber: 1
zpe: 952383.4 jmol-1
zpe.correction: 0.362744 hartree
zpe.thermalcorrener: 0.387451 hartree
zpe.thermalcorrenthalpy: 0.388395 hartree
zpe.thermalcorrgfe: 0.302293 hartree
zpe.sumelectzpe: -1274.849680 hartree
zpe.sumelectthermal: -1274.824972 hartree
zpe.sumelectthermalent: -1274.824028 hartree
zpe.sumelectthermalfe: -1274.910131 hartree
dipole: -0.4375 -2.7152 -1.9816
dipole: 3.3898
quadrupole: -109.9898 -158.5672 -168.4310
quadrupole: -4.2621 6.7588 -0.0022
quadrupole: 35.6729 -12.9045 -22.7683 -4.2621 6.7588 -0.0022
hfenergy: -1275.2124236 hartree
pointgroup: C01 [X(C21H19N3O4)]
dipole: -0.1961587 1.2002973 0.5471835 debye
polarizability: 351.9563071|16.8513013|269.7477863|31.1242706|-11.5309191|165.6191712 unknown
InChI: InChI=1S/C21H19N3O4/c1-22(10-12-23-18(25)14-6-2-3-7-15(14)19(23)26)11-13-24-20(27)16-8-4-5-9-17(16)21(24)28/h2-9H,10-13H2,1H3
charge 0 multiplicity 1
47 atoms
O  2.448487 0.70656 -1.776158
O  4.739643 -1.893245 1.412803
O  -4.513299 -2.218261 -1.101338
O  -2.28215 1.658465 0.374612
N  -0.01651 -2.375543 0.680665
N  3.338569 -0.825538 -0.188131
N  -3.091584 -0.43875 -0.406456
C  1.085017 -1.390296 0.739277
C  -1.36475 -1.781922 0.802764
C  2.241135 -1.80137 -0.208853
C  -1.799801 -1.127486 -0.533721
C  0.199171 -3.544806 1.558695
C  3.351384 0.366227 -0.971682
C  4.500833 -0.939637 0.63033
C  -4.35237 -1.0406 -0.69513
C  -3.233323 0.906068 0.046375
C  4.632054 1.062856 -0.623552
C  5.320817 0.281324 0.336616
C  -5.376936 0.017774 -0.41401
C  -4.7067 1.183872 0.030273
C  5.158829 2.272665 -1.098119
C  6.560711 0.684891 0.853843
C  -6.773732 -0.022862 -0.533992
C  -5.411106 2.348217 0.369778
C  6.412896 2.690549 -0.580247
C  7.102908 1.908702 0.380547
C  -7.496534 1.150411 -0.192547
C  -6.825626 2.317751 0.252384
H  1.484548 -1.273727 1.774979
H  0.709867 -0.401166 0.422515
H  -1.427786 -1.023009 1.619622
H  -2.080798 -2.587654 1.045826
H  1.851348 -1.873075 -1.238091
H  2.661177 -2.777541 0.08802
H  -1.896958 -1.905921 -1.308363
H  -1.052611 -0.384671 -0.863175
H  -0.568917 -4.311018 1.354376
H  0.163534 -3.291328 2.646757
H  1.185117 -3.996855 1.353148
H  4.616474 2.867132 -1.839909
H  7.084861 0.07331 1.594864
H  -7.280168 -0.929405 -0.879745
H  -4.882288 3.243751 0.710747
H  6.856106 3.630541 -0.926002
H  8.068883 2.256517 0.762114
H  -8.588791 1.156816 -0.273517
H  -7.409832 3.208187 0.508309
