program: Gaussian 09
title: 000088484
version: EM64L-G09RevD.01
frameworkgroup: C1[X(C12H17NO)]
method: RPBEPBE
basis: SDD
operation: Freq
keyword: #p
keyword: freq=noraman
keyword: PBEPBE/SDD
title: #p freq=noraman PBEPBE/SDD
converged: YES YES NO NO
title: Mulliken charges:
elementType: O N C C C C C C C C C C C C H H H H H H H H H H H H H H H H H
charge: -0.282495 -0.383318 -0.358107 -0.344788 -0.402730 -0.347574 -0.693077 0.161203 0.274006 -0.351826 -0.353529 -0.221643 -0.238209 -0.228043 0.230839 0.197500 0.179687 0.191423 0.256426 0.204637 0.200788 0.193791 0.302782 0.218149 0.208033 0.208275 0.275500 0.210554 0.231728 0.228240 0.231778
chargesum: 0.00000
title: Mulliken charges with hydrogens summed into heavy atoms:
elementType: O N C C C C C C C C C C C C
charge: -0.282495 -0.080536 0.070232 0.026322 0.058333 0.047006 -0.058619 0.161203 0.274006 -0.076327 -0.142975 0.010085 -0.009969 0.003734
polarizability: 1.80163193e+02 1.24724184e+01 1.39742064e+02 -1.49770945e+01 1.37472318e+01 9.41788676e+01
1716.lowfreq: -3.2731 -0.0008 -0.0006 -0.0001 1.5779 10.2032 20.0487 27.3139 49.5808
frequency: 19.4277 27.1487 49.5703 56.1627 91.9395 121.7910 129.8188 167.3470 205.7664 235.2985 267.1419 309.5580 362.1277 385.9659 401.6517 415.3439 489.4786 501.8717 538.0155 614.6028 655.6074 687.8717 702.5756 727.6636 760.6689 792.0842 793.5048 854.1158 870.3006 888.9968 923.3310 933.1027 963.5450 983.3016 989.3413 1005.4018 1021.9071 1034.4675 1057.4035 1081.9727 1084.2542 1115.2424 1136.6967 1150.3352 1172.9265 1190.1530 1211.2933 1239.0368 1266.6305 1274.5133 1287.5693 1298.5973 1315.6450 1337.6030 1349.8862 1369.1269 1384.3195 1388.1375 1431.4509 1445.9089 1459.4865 1466.0099 1469.8727 1476.7256 1478.5054 1486.9387 1497.3816 1572.6241 1606.2457 1611.1081 2947.6453 2968.5530 2971.7019 2977.2643 2992.2289 2997.3699 3022.5588 3046.8313 3068.2465 3071.3670 3071.5907 3114.3393 3131.0747 3144.0023 3157.6526 3169.2801 3571.1448
redmass: 4.0434 4.1562 5.4966 1.5970 2.9613 2.9247 3.2795 2.7735 3.1723 1.1157 4.4777 4.0930 2.9546 2.9283 2.7836 3.7218 4.3556 1.7206 1.5985 6.3555 5.4459 4.7290 1.5095 1.1191 1.6921 1.7285 2.4323 1.2543 1.9572 1.9634 2.0984 1.4599 1.5205 1.4001 5.6729 1.3430 2.4756 2.4642 2.6117 1.8530 1.7899 2.2645 2.0414 2.6990 1.0585 1.1491 1.4199 1.3738 1.8468 1.2929 1.0596 1.2745 1.3365 1.3883 1.5297 1.3358 9.1377 1.2184 2.1204 1.1884 1.0827 1.0933 1.8162 1.0700 1.0456 1.0821 2.1089 6.4000 6.7021 6.1263 1.0588 1.0588 1.0369 1.0635 1.0943 1.0640 1.1015 1.1006 1.1008 1.1023 1.0995 1.0874 1.0868 1.0920 1.0956 1.1006 1.0776
irintensity: 1.6196 0.1692 8.0033 0.2653 0.2235 0.9966 0.1641 2.0249 4.2478 0.0102 3.3543 8.9044 2.7489 1.2972 0.7242 4.5802 3.1002 31.6010 83.8935 0.4954 6.4140 6.5371 96.8933 18.4737 3.6050 1.5793 19.2309 1.0707 5.3083 5.2542 8.8533 2.9367 2.7953 1.0606 0.4286 1.7613 5.0067 7.3221 3.6565 13.2570 5.7160 8.2976 1.5831 5.0401 0.7987 6.8507 0.9190 1.6626 73.3573 18.9825 0.7942 64.4288 3.3638 8.8519 0.5047 6.4449 1.3577 9.9046 2.6399 45.6682 5.0327 9.8513 101.2419 5.6065 11.6077 16.9126 165.3091 85.8373 62.5241 3.6819 18.5779 33.9176 33.2101 52.8849 17.8432 36.9807 9.5087 63.6564 86.4339 25.5915 53.3475 14.1792 1.6824 24.2612 16.1671 21.0702 11.5197
temp: 298.150 k
press: 1.00000 atm
elementType: 8 7 6 6 6 6 6 6 6 6 6 6 6 6 1 1 1 1 1 1 1 1 1 1 1 1 1 1 1 1 1
symmnumber: 1
zpe: 694517.5 jmol-1
zpe.correction: 0.264528 hartree
zpe.thermalcorrener: 0.279139 hartree
zpe.thermalcorrenthalpy: 0.280084 hartree
zpe.thermalcorrgfe: 0.220261 hartree
zpe.sumelectzpe: -596.407632 hartree
zpe.sumelectthermal: -596.393021 hartree
zpe.sumelectthermalent: -596.392077 hartree
zpe.sumelectthermalfe: -596.451899 hartree
dipole: -0.6486 2.8476 2.3813
dipole: 3.7683
quadrupole: -73.6361 -87.7870 -86.3327
quadrupole: 5.6984 -2.3506 -1.5405
quadrupole: 8.9492 -5.2017 -3.7475 5.6984 -2.3506 -1.5405
hfenergy: -596.6721602 hartree
pointgroup: C01 [X(C12H17N1O1)]
dipole: -0.232799 1.1295995 0.9315654 debye
polarizability: 180.924187|11.3230598|139.248315|-14.1658889|14.0211615|93.9116231 unknown
InChI: InChI=1S/C12H17NO/c1-2-3-7-10-13-12(14)11-8-5-4-6-9-11/h4-6,8-9,13H,2-3,7,10H2,1H3
charge 0 multiplicity 1
31 atoms
O  0.467621 -2.162562 -0.726208
N  -0.512355 -0.811361 0.889966
C  -2.84495 -1.105359 -0.032897
C  -3.359102 0.317709 0.276451
C  -1.753011 -1.606526 0.94258
C  -4.453606 0.791311 -0.70716
C  -4.968194 2.21379 -0.397762
C  0.521038 -1.13533 0.024416
C  1.723414 -0.221488 0.036277
C  2.939696 -0.738242 -0.478362
C  1.685196 1.118351 0.504834
C  4.10315 0.058285 -0.500334
C  2.849402 1.917845 0.478667
C  4.06302 1.38798 -0.017389
H  -2.441036 -1.147164 -1.062706
H  -3.692154 -1.82057 0.005552
H  -3.760202 0.351366 1.31225
H  -2.510587 1.032575 0.241008
H  -1.482137 -2.646377 0.687726
H  -2.13168 -1.587826 1.982524
H  -4.051041 0.757611 -1.739709
H  -5.301014 0.076149 -0.681099
H  -0.401277 -0.02873 1.533753
H  -5.749363 2.526623 -1.11467
H  -5.402029 2.266613 0.618857
H  -4.146597 2.953145 -0.450641
H  2.940353 -1.764357 -0.860331
H  0.746984 1.565411 0.856803
H  5.038845 -0.3531 -0.894602
H  2.807973 2.953345 0.834182
H  4.965745 2.008683 -0.036677
