program: Gaussian 09
title: 000088475
version: EM64L-G09RevD.01
frameworkgroup: C1[X(C10H12O)]
method: RPBEPBE
basis: SDD
operation: Freq
keyword: #pfreq=noraman
keyword: PBEPBE/SDD
title: #p freq=noraman PBEPBE/SDD
converged: NO YES NO NO
title: Mulliken charges:
elementType: O C C C C C C C C C C H H H H H H H H H H H H
charge: -0.446320 -0.546814 -0.448654 0.168143 -0.544502 0.318162 0.143974 -0.431815 0.159520 -0.411492 -0.806466 0.224340 0.225099 0.216242 0.220142 0.220787 0.221525 0.237117 0.211822 0.222702 0.234595 0.259658 0.352235
chargesum: 0.00000
title: Mulliken charges with hydrogens summed into heavy atoms:
elementType: O C C C C C C C C C C
charge: -0.094085 -0.097375 -0.012270 0.168143 -0.102190 0.318162 0.143974 -0.194698 0.159520 -0.199671 -0.089511
polarizability: 1.38399189e+02 -1.05042801e+00 1.20725409e+02 1.91155162e+00 -2.74596301e-02 6.17411298e+01
1716.lowfreq: -13.6154 -4.2404 -0.0007 -0.0005 -0.0003 9.5545 43.1088 113.6862 146.7541
frequency: 42.3144 113.6751 146.7464 172.3803 247.5097 262.7095 313.2344 326.6965 347.9941 438.4051 473.8432 490.0833 549.4348 578.5903 585.4479 665.1418 709.4261 741.8965 791.2504 837.2910 870.3648 882.2720 913.1487 919.7358 983.2843 1016.4516 1029.8556 1048.9538 1055.1734 1126.9173 1151.6669 1154.9409 1174.5358 1210.0430 1227.4610 1241.6836 1259.7575 1283.4502 1289.5492 1317.0281 1392.1568 1398.1076 1434.8403 1459.7596 1463.8130 1468.4949 1478.1131 1481.5615 1491.2165 1609.0370 1618.9987 2962.3930 2965.8536 2975.6853 3000.3055 3037.4603 3041.0125 3057.3586 3073.1401 3102.9478 3104.8040 3138.9826 3584.2749
redmass: 1.0391 3.4810 2.4066 2.3025 2.3408 2.8256 3.9750 2.1946 1.4413 6.0632 3.8279 3.0330 3.7055 3.6171 3.0438 2.5200 3.1433 5.5904 1.4831 2.1430 2.7826 1.5101 1.6901 1.6643 3.4266 2.2558 1.5058 1.6539 1.6671 1.2147 1.3287 1.7764 1.4456 1.2727 2.3619 1.5854 2.7626 1.6152 1.6771 1.4846 4.9644 1.2518 2.6856 1.0868 1.0971 1.0887 1.1941 1.2513 2.4615 8.0023 7.0201 1.0669 1.0658 1.0411 1.0646 1.0954 1.0921 1.0924 1.1041 1.0986 1.0884 1.0958 1.0659
irintensity: 0.4231 0.6180 0.6152 0.9117 21.9520 0.6903 10.3796 20.8698 102.5935 4.5387 0.7103 0.0778 2.5800 4.0175 2.1954 2.4336 3.7873 9.0370 49.7320 9.3884 4.9572 1.0405 0.9692 1.6119 27.9734 2.5530 5.0167 57.7021 55.1616 0.6448 52.4438 10.5374 11.7507 3.7591 1.6924 48.9022 52.8405 0.3392 2.6230 4.2337 33.8813 15.3915 7.5214 10.8766 6.7276 6.9135 7.7378 4.1533 50.3566 8.7515 13.8077 34.3412 47.4796 27.0639 35.3869 27.9534 45.2423 22.9365 56.6053 4.3975 23.3616 21.1435 28.5371
temp: 298.150 k
press: 1.00000 atm
elementType: 8 6 6 6 6 6 6 6 6 6 6 1 1 1 1 1 1 1 1 1 1 1 1
symmnumber: 1
zpe: 504409.4 jmol-1
zpe.correction: 0.192119 hartree
zpe.thermalcorrener: 0.202264 hartree
zpe.thermalcorrenthalpy: 0.203208 hartree
zpe.thermalcorrgfe: 0.156560 hartree
zpe.sumelectzpe: -462.682964 hartree
zpe.sumelectthermal: -462.672819 hartree
zpe.sumelectthermalent: -462.671875 hartree
zpe.sumelectthermalfe: -462.718523 hartree
dipole: -0.3408 -0.9108 -0.0301
dipole: 0.9729
quadrupole: -59.1634 -59.8327 -68.1718
quadrupole: -5.9389 0.4445 -0.2196
quadrupole: 3.2258 2.5566 -5.7825 -5.9389 0.4445 -0.2196
hfenergy: -462.8750829 hartree
pointgroup: C01 [X(C10H12O1)]
dipole: -0.1294079 0.3600703 0.0111854 debye
dipolederiv: -1.4392792 0.147251 0.0232272 0.2231854 -0.0968081 -0.0063966 0.03972 -0.0071298 -0.4139895 -0.0194335 -0.0120192 -0.0146147 -0.0570835 0.023595 0.0251044 0.0225206 0.0302023 0.1644657 0.1177817 0.0438247 -0.0564851 0.0353053 0.0097773 -0.0220795 0.0233262 0.0075305 0.1522022 0.0988023 0.0793191 -0.0089905 0.231916 0.0956153 -0.0006792 -0.0563867 -0.0456708 -0.0721947 0.0198831 -0.0518541 -0.004239 0.0072313 0.0463598 -0.0333842 0.0371319 -0.0268144 0.1775112 0.1294599 -0.0565078 -0.011443 -0.1604242 -0.2479982 -0.0006051 -0.0875559 0.0039501 -0.07133 -0.238668 -0.0292234 0.0000361 -0.290171 0.2725525 0.0089621 -0.0002546 0.0539995 -0.056362 0.046832 0.1289617 -0.0100901 -0.0193212 0.1109832 -0.0013905 0.0030785 -0.0037519 -0.1629084 1.2720184 -0.1064438 -0.0375372 -0.1445448 -0.0109259 0.0058654 -0.0378865 0.0102925 0.038873 -0.2511868 -0.0731742 0.0014938 0.2806962 -0.0447677 -0.0089481 0.0013875 -0.009104 -0.2075362 0.0020743 0.0486966 -0.0100795 0.0893218 -0.1141988 -0.0059593 -0.0022174 -0.0638941 0.0795898 0.036103 0.0248575 0.0194674 -0.0020004 -0.1061182 -0.0889167 -0.016071 -0.130631 0.0120805 0.0001749 -0.0447012 0.0107071 -0.029795 0.0151177 0.0734443 0.0268559 0.1251291 -0.1182138 -0.1877969 -0.0794541 0.0635296 -0.0848853 0.0392402 0.0226553 0.109698 0.0341665 0.0498171 0.0758228 0.0111878 -0.008777 0.0152709 0.0447836 -0.0047309 -0.0882939 -0.0274616 -0.1720286 -0.0568443 0.0196721 0.0596485 -0.0119469 0.053035 -0.0430071 0.1177684 -0.0831386 -0.1285224 -0.0239724 0.0556481 -0.0419293 0.0927676 -0.0726281 0.083393 -0.1052119 0.1041991 0.0167491 0.0600219 0.0723353 0.0014511 0.0506793 -0.1045504 0.0009079 -0.0049164 0.0015116 0.1541756 -0.0824921 -0.1260903 0.0083926 -0.1011033 -0.0185587 0.0068502 0.0116786 0.0103845 0.1695281 0.0105626 -0.1080177 0.0983076 -0.0460332 -0.0237645 0.054934 0.0656903 0.0923209 0.0314372 0.1064838 0.0203502 -0.0052402 0.0374912 -0.0168182 -0.0610661 0.0197137 -0.1117391 -0.0971402 -0.0557926 0.0658486 -0.0771122 -0.003134 0.094476 -0.0065954 -0.0750966 0.0313314 0.0789962 0.3794452 -0.0304671 0.0002768 -0.113422 0.0516013 0.0016422 -0.0046788 0.0043172 0.3748 unknown
polarizability: 138.4346053|0.8166069|120.7008262|-1.6802751|-0.0448891|61.7302954 unknown
InChI: InChI=1S/C10H12O/c1-7-9-4-2-3-8(9)5-6-10(7)11/h5-6,11H,2-4H2,1H3
charge 0 multiplicity 1
23 atoms
O  3.161129 -0.053126 -0.054885
C  -1.690696 -1.433122 0.110946
C  -2.896595 -0.528739 -0.295846
C  -0.502389 -0.478156 0.051737
C  -2.47914 0.916868 0.119155
C  -0.957291 0.867561 0.04818
C  0.871668 -0.807711 0.029063
C  -0.030559 1.926003 0.013371
C  1.787619 0.281176 -0.016272
C  1.352185 1.628048 -0.02304
C  1.369155 -2.240349 0.036488
H  -1.578227 -2.31222 -0.549195
H  -1.818651 -1.822019 1.143136
H  -3.846465 -0.850195 0.166308
H  -3.024048 -0.568371 -1.394112
H  -2.811487 1.13718 1.154842
H  -2.922869 1.69109 -0.533165
H  -0.364524 2.969795 0.00947
H  2.09041 2.440817 -0.06061
H  0.695607 -2.893716 0.618324
H  1.424115 -2.649563 -0.991729
H  2.383852 -2.300271 0.4619
H  3.715003 0.766221 -0.069565
