program: Gaussian 09
title: 000088474
version: EM64L-G09RevD.01
frameworkgroup: C1[X(C10H12O)]
method: RPBEPBE
basis: SDD
operation: Freq
keyword: #pfreq=noraman
keyword: PBEPBE/SDD
title: #p freq=noraman PBEPBE/SDD
converged: NO YES NO NO
title: Mulliken charges:
elementType: O C C C C C C C C C C H H H H H H H H H H H H
charge: -0.436207 -0.447171 -0.552964 -0.519734 0.344035 0.162307 -0.641755 0.135741 0.525237 -0.588323 -0.819611 0.221807 0.214931 0.223428 0.223577 0.224784 0.239116 0.243419 0.216935 0.224756 0.220605 0.233070 0.352016
chargesum: 0.00000
title: Mulliken charges with hydrogens summed into heavy atoms:
elementType: O C C C C C C C C C C
charge: -0.084191 -0.010432 -0.105959 -0.055834 0.344035 0.162307 -0.398337 0.135741 0.525237 -0.371388 -0.141180
polarizability: 1.39656423e+02 8.72203882e-02 1.21633587e+02 -1.34763567e+00 -8.19926995e-01 6.24054016e+01
1716.lowfreq: -11.1518 -7.8408 -0.0010 -0.0009 -0.0008 7.2123 47.2708 114.3934 146.0769
frequency: 46.9123 114.3910 146.0760 193.5491 230.7769 252.4508 274.5290 296.5408 363.7068 447.0647 474.6904 521.9097 544.3150 573.4365 590.0088 637.0893 702.0113 757.7664 827.6738 843.3588 864.4788 887.3837 911.2202 951.2440 970.3090 1015.3880 1022.5277 1041.5497 1048.1059 1111.7228 1125.5595 1162.2492 1181.2056 1199.8411 1217.9383 1246.5237 1279.9174 1288.2759 1305.8532 1329.8531 1388.2288 1396.2190 1424.7210 1458.0649 1463.2029 1473.2456 1476.3074 1479.4280 1502.9108 1606.2578 1634.3370 2969.0116 2971.7970 2973.5238 3001.9583 3041.8896 3052.1316 3053.7963 3075.1228 3081.8076 3096.2568 3125.1603 3575.6529
redmass: 1.0173 2.6783 2.4361 2.4784 3.0929 3.9679 3.0083 2.4858 1.2057 4.9129 3.8162 2.9620 4.8818 3.8102 4.0710 2.4098 2.5872 3.2172 1.4722 2.1694 1.4040 1.4914 2.4558 3.9560 2.4682 2.0629 2.0961 1.6015 1.6198 2.6512 1.2523 1.2661 1.3196 1.3992 1.5417 1.3431 1.5099 1.5754 1.9359 2.8102 4.8506 1.2499 4.0934 1.1254 1.1094 1.0533 1.1444 1.1022 2.8976 6.7303 7.5875 1.0656 1.0387 1.0677 1.0642 1.0945 1.0952 1.0932 1.1039 1.0995 1.0908 1.0918 1.0658
irintensity: 0.4367 2.4146 1.1526 4.3208 0.7632 8.3256 1.1885 22.1327 113.1161 0.7056 1.8402 1.7198 2.1959 6.9127 6.0447 2.1466 4.9815 3.8142 33.5780 4.5193 5.8620 3.6793 4.6702 0.5151 44.5635 35.1990 8.8079 6.9506 14.6570 67.2851 0.0939 15.1420 12.6824 11.1945 17.2445 56.0391 4.1167 8.2423 6.4970 24.0161 2.7253 8.1821 20.0824 11.0581 5.2316 12.7249 33.1103 6.7903 14.6889 72.3817 25.6364 35.8777 43.9421 33.1545 38.8063 33.0574 24.0370 26.9101 56.8825 16.3126 25.8522 13.0075 24.5970
temp: 298.150 k
press: 1.00000 atm
elementType: 8 6 6 6 6 6 6 6 6 6 6 1 1 1 1 1 1 1 1 1 1 1 1
symmnumber: 1
zpe: 504348.2 jmol-1
zpe.correction: 0.192096 hartree
zpe.thermalcorrener: 0.202275 hartree
zpe.thermalcorrenthalpy: 0.203219 hartree
zpe.thermalcorrgfe: 0.156503 hartree
zpe.sumelectzpe: -462.683873 hartree
zpe.sumelectthermal: -462.673694 hartree
zpe.sumelectthermalent: -462.672750 hartree
zpe.sumelectthermalfe: -462.719466 hartree
dipole: 1.2435 -0.1011 0.0446
dipole: 1.2484
quadrupole: -58.3608 -59.9309 -68.1406
quadrupole: 5.5498 -0.3328 -0.4656
quadrupole: 3.7833 2.2132 -5.9965 5.5498 -0.3328 -0.4656
hfenergy: -462.8759692 hartree
pointgroup: C01 [X(C10H12O1)]
dipole: 0.4884845 -0.0477708 0.0179502 debye
dipolederiv: -0.1110646 0.2094454 -0.0137028 0.1379918 -1.3799773 -0.0011145 -0.0121521 -0.0020648 -0.4137825 0.1149369 0.0192003 -0.0559558 0.0214781 -0.004609 -0.0105736 0.0257481 0.0022412 0.1507741 -0.0309477 0.0093417 -0.0127855 -0.0488644 0.0431669 0.0315092 0.0327673 0.0442746 0.16264 0.0129505 0.0020336 -0.0073309 0.0368279 0.047553 -0.0216673 0.0270947 -0.0099081 0.180344 0.2138964 0.0646904 -0.0173513 0.1416385 0.2190437 0.0013669 -0.0790394 -0.0386883 -0.0355365 0.0892083 -0.237828 -0.007266 -0.1259519 -0.4138877 -0.0001158 -0.0683514 0.0173913 -0.0971387 -0.3738234 -0.0012671 0.0021093 -0.105482 -0.0308297 -0.0107655 0.0095149 -0.0004631 -0.2256114 0.1471152 -0.0716133 -0.0089285 -0.0617965 1.346234 -0.0072174 -0.0078994 -0.0068845 0.0832912 0.3500065 -0.0906253 0.0042729 0.0056605 0.1728903 -0.0045511 0.0768901 -0.0184465 -0.0097974 -0.2148832 0.2609608 -0.0015592 0.0875661 -0.2768054 -0.0001628 -0.003594 -0.0072128 -0.2451811 -0.1087283 0.0613173 -0.0039172 0.0403064 0.0632307 -0.0025344 -0.0974488 0.0267456 0.0727669 0.0775463 0.007459 -0.0140598 0.0066239 0.0438245 -0.005295 -0.095001 -0.0207087 -0.1721906 -0.2031745 -0.0498405 0.0699048 -0.0503204 0.0584557 0.0134884 0.1134829 0.023793 0.0474781 0.0305269 0.0064804 0.0045868 -0.0260235 -0.1120663 -0.0926572 -0.0399884 -0.1373435 0.0202619 -0.016433 -0.0501996 0.0260708 -0.0213632 0.0319148 0.0656431 0.0482605 0.1193901 -0.1228577 -0.0407288 0.0221493 0.0484707 -0.0007891 0.0518465 -0.0543155 0.0941925 -0.0934858 -0.1168053 0.0133609 0.0345309 -0.0303271 0.0630986 -0.0533996 0.083035 -0.0836586 0.0992043 0.0194233 0.0663069 0.0386557 0.0052516 0.0526919 -0.107795 0.0013978 0.0020003 -0.0071556 0.1583881 -0.0446652 -0.1082343 0.0103953 -0.1115701 -0.0429166 0.0046411 0.0166243 0.0082303 0.1661453 0.0611784 -0.0251748 -0.0107907 0.0693132 -0.1139124 -0.0906304 0.0383774 -0.0858086 0.070168 -0.0400113 -0.0320331 0.0637694 -0.1119318 -0.0055929 0.0986447 0.1155731 0.0572096 0.0362946 -0.0427679 0.0421431 -0.0652457 0.0379267 0.0940555 0.0001185 -0.1253177 0.0222835 -0.0994899 0.050195 -0.1115918 0.0143889 -0.0370308 0.3695762 0.0017559 0.0119248 0.0074068 0.3704156 unknown
polarizability: 139.6573488|-0.2010453|121.6393283|-1.2780795|-0.640732|62.3987351 unknown
InChI: InChI=1S/C10H12O/c1-7-5-8-3-2-4-9(8)10(11)6-7/h5-6,11H,2-4H2,1H3
charge 0 multiplicity 1
23 atoms
O  0.016837 2.742955 0.01162
C  -2.859385 -0.642965 -0.286444
C  -1.790541 -1.704543 0.125843
C  -2.240718 0.737445 0.103634
C  -0.478746 -0.929073 0.054888
C  -0.747826 0.460065 0.050746
C  0.842549 -1.420252 0.018212
C  0.3282 1.367422 0.012348
C  1.929446 -0.50727 -0.026725
C  1.660099 0.885478 -0.033282
C  3.365194 -1.007468 -0.045373
H  -3.002887 -0.678491 -1.382789
H  -3.840318 -0.819987 0.188451
H  -1.802315 -2.598921 -0.523432
H  -1.966844 -2.05682 1.163272
H  -2.541428 1.037486 1.128468
H  -2.548648 1.556904 -0.568821
H  1.03859 -2.499143 0.015669
H  2.498161 1.596135 -0.078208
H  3.430007 -2.023284 -0.473241
H  4.020331 -0.344845 -0.639155
H  3.786044 -1.053997 0.97829
H  0.843199 3.28607 -0.028571
