program: Gaussian 09
title: 000008002
version: EM64L-G09RevD.01
frameworkgroup: C1[X(C4H9Br)]
method: RPBEPBE
basis: SDD
operation: Freq
keyword: #pfreq=noraman
keyword: PBEPBE/SDD
title: #p freq=noraman PBEPBE/SDD
converged: YES YES NO NO
title: Mulliken charges:
elementType: Br C C C C H H H H H H H H H
charge: -0.049069 -0.290770 -0.345851 -0.673779 -0.679224 0.221994 0.221879 0.199306 0.199226 0.274150 0.274269 0.213719 0.220393 0.213756
chargesum: 0.00000
title: Mulliken charges with hydrogens summed into heavy atoms:
elementType: Br C C C C
charge: -0.049069 0.153104 0.052680 -0.125359 -0.031357
polarizability: 8.48743836e+01 7.51750170e+00 4.83582893e+01 1.79088620e-02 7.51329042e-03 4.15897090e+01
1716.lowfreq: -14.6115 -0.0004 0.0004 0.0005 9.4689 10.5519 90.2132 102.7679 134.9305
frequency: 90.1725 102.7524 134.9287 237.2048 259.6338 377.1755 612.1857 738.2383 775.5000 890.8021 903.1822 1027.4764 1041.4889 1066.5125 1100.3806 1200.4216 1223.1488 1268.4623 1287.1894 1296.2476 1339.6533 1393.3567 1450.8258 1469.1321 1476.0927 1478.8865 1487.3560 2972.0198 2978.8894 2998.8474 3017.4353 3049.0816 3058.3948 3078.1120 3078.7211 3134.0733
redmass: 2.1455 2.0263 3.7228 1.1216 5.0197 2.7686 5.3389 1.0681 1.1502 1.8615 1.1948 3.7859 1.1007 2.4956 2.2624 1.5511 1.1908 1.2202 1.0644 1.2995 1.4841 1.2068 1.1037 1.0724 1.0614 1.0416 1.0836 1.0581 1.0367 1.0596 1.1011 1.0564 1.1037 1.1013 1.0996 1.1111
irintensity: 0.6684 0.0215 1.3088 0.0091 3.1699 1.5614 38.5008 13.1712 0.1411 3.7317 4.1610 9.9561 0.5308 7.1516 8.8847 1.0890 26.6036 1.0980 0.0614 25.0636 4.3498 8.4951 2.8449 1.0981 3.1371 13.6085 17.2824 32.8229 29.5195 25.8838 8.2403 24.5183 9.6310 75.1620 46.5326 20.9570
temp: 298.150 k
press: 1.00000 atm
elementType: 35 6 6 6 6 1 1 1 1 1 1 1 1 1
symmnumber: 1
zpe: 317572.5 jmol-1
zpe.correction: 0.120957 hartree
zpe.thermalcorrener: 0.127930 hartree
zpe.thermalcorrenthalpy: 0.128874 hartree
zpe.thermalcorrgfe: 0.088666 hartree
zpe.sumelectzpe: -170.855395 hartree
zpe.sumelectthermal: -170.848422 hartree
zpe.sumelectthermalent: -170.847478 hartree
zpe.sumelectthermalfe: -170.887686 hartree
dipole: 2.6786 0.8776 0.0014
dipole: 2.8187
quadrupole: -43.5141 -41.2143 -41.6765
quadrupole: 0.5440 0.0000 0.0035
quadrupole: -1.3792 0.9207 0.4585 0.5440 0.0000 0.0035
hfenergy: -170.9763515 hartree
pointgroup: C01 [X(C4H9Br1)]
dipole: -1.0309807 0.4084667 0.0062898 debye
dipolederiv: -0.634332 0.0700452 0.0019071 0.1913175 -0.2157857 -0.0009936 0.0027241 -0.0006438 -0.1619831 -0.2327617 -0.0012023 0.0011821 0.2104564 -0.0097229 -0.0017479 0.0034863 -0.0012145 0.1374634 0.0012944 -0.0174939 0.0003658 -0.2464107 0.1240657 -0.0002461 -0.0024244 -0.0008658 0.1903116 0.8235597 -0.2427398 -0.0041076 -0.2664149 0.2376301 0.0014624 -0.0039229 0.0014442 0.1391142 -0.065082 -0.036611 0.0000268 0.0571704 0.0353557 -0.0008365 0.001604 -0.0007243 0.0933523 0.06014 0.0050409 0.0042494 -0.0199272 -0.0163965 0.1029679 -0.0018481 0.1159825 -0.0582145 0.0599981 0.0041848 -0.0049614 -0.0207624 -0.0118474 -0.1020243 0.0004123 -0.1151575 -0.0630364 0.044513 -0.0207661 -0.020564 0.0083979 -0.0401365 -0.1221883 0.0037415 -0.1500294 -0.0882865 0.0450742 -0.0204056 0.0191807 0.0091705 -0.0472162 0.1232184 -0.0042994 0.1512323 -0.0813137 -0.0375322 0.0797908 0.0311054 0.0323654 -0.0249628 -0.091249 -0.018153 -0.1037063 -0.024301 -0.0376274 0.0805742 -0.0294814 0.0323661 -0.0282429 0.090971 0.0187313 0.103256 -0.0207845 0.0800243 0.0042568 -0.0308264 -0.0435643 -0.0149634 0.1195588 0.0166388 0.1365447 -0.0796803 -0.1873024 0.0932751 0.0025466 0.0999916 0.0197068 -0.0018078 0.0027634 -0.0016773 0.1046198 0.0800339 0.0020509 0.029377 -0.0441563 -0.0074842 -0.117085 -0.019454 -0.1344411 -0.0872613 unknown
polarizability: 83.8302216|-9.6703448|49.4011158|-0.193623|0.0950098|41.5910445 unknown
InChI: InChI=1S/C4H9Br/c1-2-3-4-5/h2-4H2,1H3
charge 0 multiplicity 1
14 atoms
Br 2.920728 -0.405494 -0.016701
C  -0.040637 -0.299294 -0.008754
C  -1.369244 0.50337 0.005645
C  1.168095 0.637625 -0.003663
C  -2.603291 -0.425502 -0.002511
H  -0.001071 -0.966084 0.87325
H  -0.008416 -0.947036 -0.905141
H  -1.399501 1.153722 0.903027
H  -1.405271 1.176869 -0.874275
H  1.22455 1.256741 0.905426
H  1.220553 1.272068 -0.902332
H  -2.604114 -1.090726 0.880866
H  -3.54226 0.157004 0.010515
H  -2.612421 -1.064265 -0.905151
