program: Gaussian 09
title: 000088574
version: EM64L-G09RevD.01
frameworkgroup: C1[X(C19H21N3O)]
method: RPBEPBE
basis: SDD
operation: Freq
keyword: #p
keyword: freq=noraman
keyword: PBEPBE/SDD
title: #p freq=noraman PBEPBE/SDD
converged: YES YES NO NO
title: Mulliken charges:
elementType: O N N N C C C C C C C C C C C C C C C C C C C H H H H H H H H H H H H H H H H H H H H H
charge: -0.298904 -0.091462 -0.337680 -0.153958 -0.329282 -0.402151 0.154347 0.000492 0.150145 0.315579 0.336579 -0.613783 -0.616836 -0.396973 -0.383875 -0.385027 -0.400033 -0.234576 -0.234376 -0.239607 -0.238787 -0.251813 -0.248250 0.200752 0.222050 0.244093 0.232643 0.319202 0.228748 0.196859 0.221729 0.223170 0.191202 0.223901 0.262694 0.250437 0.262733 0.259736 0.228130 0.224987 0.224529 0.226866 0.228601 0.227167
chargesum: 0.00000
title: Mulliken charges with hydrogens summed into heavy atoms:
elementType: O N N N C C C C C C C C C C C C C C C C C C C
charge: -0.298904 -0.091462 -0.018478 -0.153958 0.093520 0.074585 0.154347 0.000492 0.150145 0.315579 0.336579 0.033553 0.021437 -0.134279 -0.133438 -0.122294 -0.140297 -0.006447 -0.009388 -0.015077 -0.011921 -0.023211 -0.021083
polarizability: 3.28568639e+02 -2.09859295e+01 2.89143863e+02 2.37720141e+01 -1.30925790e+01 1.35539644e+02
1716.lowfreq: -2.8792 -0.0006 -0.0004 0.0003 4.1003 6.2863 17.4559 23.7497 25.9902
frequency: 17.2673 23.5377 25.9068 36.3637 50.0582 73.2682 80.1260 93.2126 97.1233 132.2582 178.1124 188.4469 210.2895 214.2265 239.4656 247.0592 270.7715 283.3292 316.7114 347.9597 364.2302 376.1374 391.4753 401.9918 409.1429 411.9925 436.9892 489.0178 505.6499 529.4518 602.0857 615.0820 616.0774 663.1827 665.5734 671.3414 691.8847 697.5463 704.3557 734.5125 768.3973 776.6857 798.7527 823.6290 848.3884 860.1738 907.9250 921.4029 933.2992 936.2261 977.1502 984.9651 986.2321 988.6385 990.6137 994.0820 998.0415 1017.8836 1026.2670 1033.4000 1037.0053 1049.9030 1061.4180 1079.2981 1081.5073 1090.5156 1090.8226 1120.8224 1141.4117 1169.8237 1171.9968 1172.9172 1190.0515 1194.0263 1213.0926 1235.2748 1265.5988 1272.4820 1309.3860 1318.5491 1322.6201 1332.3330 1354.4382 1375.7337 1378.4788 1382.7412 1422.1617 1434.8450 1437.5010 1441.3422 1453.5484 1462.1422 1467.0806 1468.4697 1474.5923 1477.1754 1481.0792 1487.2899 1495.9441 1570.4400 1579.7909 1586.4548 1612.4472 1614.0423 1647.3491 2857.0454 2871.6042 2891.9055 3017.0109 3024.7670 3026.9344 3031.2092 3075.3554 3090.0250 3094.4076 3123.3869 3125.4286 3133.6174 3134.9142 3148.8333 3151.9734 3159.0469 3161.3524 3169.0112 3170.0283 3597.1006
redmass: 3.9466 3.9340 2.9787 3.7650 4.5655 4.2044 4.3395 4.0267 2.3262 6.6110 3.4232 3.8193 1.1435 2.3239 4.9398 1.5756 3.0863 5.1850 4.7774 2.6474 4.1429 4.3201 1.2376 2.7981 2.9122 2.7800 2.9761 3.6348 4.5751 3.6439 5.6945 6.4092 6.5305 6.5344 6.7120 5.3611 6.5498 1.8594 1.8085 3.4028 1.8005 1.9588 1.6688 3.8793 1.2500 1.2469 6.6744 1.4356 1.4425 7.0259 1.3833 1.4326 5.8785 6.2959 5.8250 1.3555 1.3146 2.9582 2.3434 2.0314 1.6316 2.7875 1.8406 1.7559 1.7144 2.3824 1.5161 2.6725 1.5757 1.9528 1.0926 1.0555 1.1179 1.1348 3.1889 3.8362 2.1724 1.7002 1.1806 1.4390 1.3663 1.3361 3.1121 5.9448 6.5592 1.3269 1.1419 2.3717 2.3093 1.1409 1.0925 1.0654 2.1511 1.0660 1.1073 1.4399 1.1533 1.0552 2.6600 6.8223 6.2542 7.0054 6.0926 6.0854 9.8755 1.0563 1.0574 1.0677 1.0733 1.0737 1.0753 1.0757 1.1010 1.1015 1.1041 1.0846 1.0847 1.0886 1.0888 1.0933 1.0932 1.0962 1.0953 1.0998 1.1003 1.0774
irintensity: 0.1248 0.3685 0.4007 0.5298 0.3415 2.1659 0.4136 0.6899 0.4836 2.0993 0.3006 0.2265 1.2467 1.0727 0.5889 0.2015 3.6187 1.1706 1.3156 3.9379 10.0146 6.4224 99.7093 1.2497 0.2890 24.2282 8.8904 5.5200 7.5724 15.3394 5.9730 0.4108 0.4990 20.8837 9.5234 16.3801 3.5072 94.3745 15.6740 2.2592 81.4083 26.7912 7.4765 8.3950 1.5269 0.3425 10.8720 8.8498 3.6154 30.6109 1.6762 4.4604 9.6732 9.6547 27.9779 2.5887 1.4368 6.9458 4.8143 3.6505 23.3620 62.1062 18.9281 12.8469 2.5301 4.3578 9.0754 1.8105 6.7365 6.2025 0.4222 0.0249 2.4468 0.8550 84.9368 19.1781 26.3226 4.8104 14.4843 1.5234 1.2008 4.0254 38.1757 0.7027 6.1679 2.7528 1.6508 14.7050 6.9171 2.1040 4.2124 30.2338 17.4381 7.1103 30.1683 3.3226 21.2129 10.0418 62.0150 12.9660 20.6892 13.1175 39.3296 59.6415 851.4183 104.0835 97.8094 101.0137 49.3472 27.9959 35.4213 53.4652 30.9417 38.3181 35.7546 1.3262 2.8377 10.4494 9.0567 43.4882 25.7077 14.8862 18.6184 23.8050 9.4973 77.6988
temp: 298.150 k
press: 1.00000 atm
elementType: 8 7 7 7 6 6 6 6 6 6 6 6 6 6 6 6 6 6 6 6 6 6 6 1 1 1 1 1 1 1 1 1 1 1 1 1 1 1 1 1 1 1 1 1
symmnumber: 1
zpe: 943592.0 jmol-1
zpe.correction: 0.359395 hartree
zpe.thermalcorrener: 0.380937 hartree
zpe.thermalcorrenthalpy: 0.381881 hartree
zpe.thermalcorrgfe: 0.305792 hartree
zpe.sumelectzpe: -974.415598 hartree
zpe.sumelectthermal: -974.394056 hartree
zpe.sumelectthermalent: -974.393112 hartree
zpe.sumelectthermalfe: -974.469201 hartree
dipole: -1.1915 -1.2813 0.7712
dipole: 1.9120
quadrupole: -119.6820 -120.1428 -139.0177
quadrupole: 4.5758 0.0969 -3.0610
quadrupole: 6.5988 6.1381 -12.7369 4.5758 0.0969 -3.0610
hfenergy: -974.774993 hartree
pointgroup: C01 [X(C19H21N3O1)]
dipole: 0.5676033 0.4379684 0.2278177 debye
polarizability: 316.6938392|-28.2102311|299.5768477|-30.4884326|3.9030153|136.9814582 unknown
InChI: InChI=1S/C19H21N3O/c1-22(2)14-13-20-19-21-17(15-9-5-3-6-10-15)18(23-19)16-11-7-4-8-12-16/h3-12,20H,13-14H2,1-2H3
charge 0 multiplicity 1
44 atoms
O  0.355562 2.007188 -0.490536
N  5.697299 -0.386431 -0.144702
N  2.628461 1.67778 -1.056992
N  1.116757 -0.16177 -0.555611
C  4.562157 0.536251 0.082277
C  3.827915 0.846081 -1.247978
C  -0.761651 1.139811 -0.177599
C  -0.265605 -0.167388 -0.198532
C  1.429623 1.122945 -0.710027
C  -2.045111 1.820068 -0.016058
C  -0.902711 -1.455578 0.135797
C  5.276173 -1.799245 -0.267932
C  6.787752 -0.227046 0.838631
C  -3.277055 1.162941 -0.303247
C  -2.083399 3.184883 0.394522
C  -0.383512 -2.648061 -0.440061
C  -1.979362 -1.557366 1.059742
C  -4.502954 1.842319 -0.155852
C  -3.312979 3.860343 0.533824
C  -0.947871 -3.902512 -0.128488
C  -2.538953 -2.813742 1.372966
C  -4.531508 3.192908 0.26698
C  -2.032299 -3.992533 0.775709
H  4.956391 1.481542 0.500813
H  3.820976 0.131613 0.81388
H  3.513628 -0.094855 -1.730649
H  4.520159 1.363294 -1.934462
H  2.688423 2.693529 -1.10036
H  4.489419 -1.902947 -1.033709
H  4.874282 -2.217009 0.689033
H  6.138099 -2.415685 -0.58046
H  7.642285 -0.864468 0.546819
H  6.494143 -0.507198 1.882197
H  7.13447 0.821649 0.848803
H  -3.269932 0.128986 -0.661795
H  -1.142859 3.7051 0.601208
H  0.467984 -2.568805 -1.122932
H  -2.362564 -0.657153 1.551116
H  -5.438572 1.320049 -0.385581
H  -3.320863 4.908589 0.853375
H  -0.54006 -4.810616 -0.586896
H  -3.36366 -2.874239 2.092188
H  -5.486605 3.717932 0.377698
H  -2.469876 -4.967055 1.019778
