program: Gaussian 09
title: 000088520
version: EM64L-G09RevD.01
frameworkgroup: C1[X(C10H24O4P2S3)]
method: RPBEPBE
basis: SDD
operation: Freq
keyword: #p
keyword: freq=noraman
keyword: PBEPBE/SDD
title: #p freq=noraman PBEPBE/SDD
converged: YES YES NO NO
title: Mulliken charges:
elementType: S S S P P O O O O C C C C C C C C C C H H H H H H H H H H H H H H H H H H H H H H H H
charge: -0.014066 0.002598 0.250644 0.952625 0.948476 -0.519411 -0.512050 -0.622143 -0.623477 -0.632701 -0.630412 -0.633441 -0.632397 -0.874655 -0.833630 -0.226781 -0.204617 -0.656969 -0.659216 0.265767 0.266610 0.267805 0.269482 0.250803 0.242004 0.227098 0.250049 0.242361 0.230523 0.351661 0.309874 0.351001 0.299978 0.209409 0.290595 0.228011 0.234573 0.218726 0.232373 0.209459 0.226888 0.231010 0.215561
chargesum: 0.00000
title: Mulliken charges with hydrogens summed into heavy atoms:
elementType: S S S P P O O O O C C C C C C C C C C
charge: -0.014066 0.002598 0.250644 0.952625 0.948476 -0.519411 -0.512050 -0.622143 -0.623477 -0.100324 -0.093125 0.086464 0.090536 -0.213120 -0.182651 0.273223 0.257968 0.003589 0.014243
polarizability: 2.83177697e+02 9.92903833e-01 2.32317835e+02 -3.53700920e+00 -5.75871482e-02 1.92844187e+02
1716.lowfreq: -15.9757 -5.6001 -4.2893 0.0019 0.0021 0.0026 13.8374 16.0585 26.5565
frequency: 12.6677 14.9669 26.2849 27.7192 37.2820 40.2080 48.1658 55.9250 56.2051 61.3715 71.0182 79.7568 98.4719 100.4649 104.8540 110.1588 118.6286 164.9924 182.3171 194.4311 196.1026 198.2784 218.8492 226.1795 235.0947 247.1728 250.3961 261.4755 262.5635 267.4398 286.2671 291.0886 318.6992 338.9489 343.2724 406.0385 407.1145 465.9485 476.3474 591.5859 623.9777 630.0394 644.8721 651.6048 679.0436 681.6766 687.2541 770.9337 771.1561 807.1879 816.5504 826.6128 841.5217 882.2623 885.2708 975.2031 976.0813 1002.5645 1003.1351 1020.3047 1021.7176 1052.1947 1053.9844 1062.8591 1063.5762 1105.6531 1107.6388 1131.2985 1135.0088 1140.0204 1179.1040 1243.9738 1247.2623 1251.8879 1253.0161 1257.9020 1267.4767 1280.6225 1280.9710 1357.2594 1363.7013 1382.7218 1390.2437 1394.0273 1396.2771 1397.0170 1402.5424 1425.0270 1425.5328 1456.0311 1459.2639 1470.8727 1470.9512 1474.6483 1476.4491 1485.5149 1485.7152 1486.6856 1497.3034 2987.6696 2990.7457 2993.1033 2995.4062 2995.8065 2996.7845 3009.2971 3015.5875 3032.5088 3032.8216 3053.9435 3059.7712 3089.2151 3089.8384 3090.1995 3092.2768 3095.6797 3095.9795 3106.6401 3107.4338 3114.2856 3115.9263 3116.0949 3117.4282
redmass: 3.0036 3.6323 5.2428 4.1814 3.7973 3.2654 3.6516 3.8217 3.0153 3.4077 3.5717 2.6029 4.3061 4.2246 4.5026 2.9726 3.3016 3.2144 1.9767 2.2560 2.6074 3.0373 2.2357 1.6997 2.6274 2.1170 1.9001 2.2295 2.1659 4.8246 6.4494 6.0630 6.1787 3.9501 5.5905 5.6318 5.5870 7.0963 7.1047 7.9028 5.7558 5.8082 5.7206 8.6455 4.4401 4.2121 7.8300 1.2624 1.2646 1.0916 1.0884 1.5697 1.4107 3.9298 3.9188 2.6217 2.4992 2.5015 2.5947 2.7195 2.7251 2.1042 2.0882 1.6428 1.6510 2.2292 2.2013 1.4356 1.0358 1.4396 1.0310 1.1153 1.1511 1.1789 1.1225 1.1389 1.1321 1.3154 1.3129 1.2565 1.2404 1.0665 1.2502 1.2418 1.1823 1.1831 1.0680 1.0787 1.0788 1.0404 1.0405 1.0377 1.0373 1.0592 1.0475 1.0718 1.0489 1.0477 1.0800 1.0556 1.0527 1.0373 1.0395 1.0355 1.0355 1.0577 1.0552 1.0589 1.0590 1.1076 1.1077 1.1005 1.0983 1.1009 1.0984 1.1015 1.1014 1.1026 1.1022 1.1096 1.1029 1.1028 1.1078
irintensity: 0.1428 0.5016 0.1970 0.3811 0.2433 1.0233 0.1683 0.5115 1.7481 1.1726 0.6978 0.8065 2.0955 1.8828 1.8365 3.3461 8.4296 4.3769 3.4963 7.4287 11.9660 2.2097 0.8720 13.8704 8.3381 15.2823 10.6323 4.3208 3.8774 0.2612 5.1012 3.9871 0.7629 8.7170 1.2149 9.3099 13.1959 101.3342 130.3785 5.5903 85.2630 79.7568 2.2393 31.5836 26.5003 48.5433 30.2766 23.3328 32.7100 3.2344 5.8846 5.0480 7.6043 108.5113 147.7733 37.2626 66.2874 20.7114 12.9441 109.5374 92.1838 61.7065 39.0122 7.7692 17.4671 22.8824 4.6969 4.6577 11.6235 12.0965 13.4414 10.4016 14.9618 3.1192 13.6436 1.0275 3.4636 0.7200 0.9777 6.9868 4.7233 15.9880 25.5558 22.5846 17.0831 26.6163 13.6354 8.0504 7.8369 10.4914 12.9955 12.5565 16.8473 9.8774 6.3101 12.8634 8.0033 12.5859 14.1659 16.5711 25.4908 19.6057 19.6920 31.0815 24.7459 18.7987 5.4252 4.1607 4.8200 11.0747 8.3616 13.7704 35.9492 5.1190 22.2070 6.7619 8.2214 28.1746 33.6936 2.0505 14.5636 15.8150 8.3381
temp: 298.150 k
press: 1.00000 atm
elementType: 16 16 16 15 15 8 8 8 8 6 6 6 6 6 6 6 6 6 6 1 1 1 1 1 1 1 1 1 1 1 1 1 1 1 1 1 1 1 1 1 1 1 1
symmnumber: 1
zpe: 887033.4 jmol-1
zpe.correction: 0.337853 hartree
zpe.thermalcorrener: 0.366793 hartree
zpe.thermalcorrenthalpy: 0.367737 hartree
zpe.thermalcorrgfe: 0.272056 hartree
zpe.sumelectzpe: -2571.415946 hartree
zpe.sumelectthermal: -2571.387006 hartree
zpe.sumelectthermalent: -2571.386062 hartree
zpe.sumelectthermalfe: -2571.481743 hartree
dipole: 1.7961 -1.2777 -1.8407
dipole: 2.8717
quadrupole: -131.3172 -150.0924 -157.4192
quadrupole: -3.8062 3.3564 -4.4467
quadrupole: 14.9591 -3.8161 -11.1430 -3.8062 3.3564 -4.4467
hfenergy: -2571.7537992 hartree
pointgroup: C01 [X(C10H24O4P2S3)]
dipole: 0.7484456 0.238005 0.8122093 debye
polarizability: 283.1264156|2.2994315|226.7064518|-3.6276199|13.7625863|198.5068519 unknown
InChI: InChI=1S/2C4H10O2P.C2H4S3/c2*1-3-6-7(5)4-2;3-1-5-2-4/h2*3-4H2,1-2H3;1-2H2
charge 0 multiplicity 1
43 atoms
S  -2.106765 -2.052784 0.40319
S  2.937995 -1.888477 -1.089657
S  -0.00669 -1.532128 -1.965816
P  -3.338413 -0.095165 0.055069
P  3.015141 0.028893 0.244036
O  -2.552129 1.149408 0.959336
O  3.304605 1.345461 -0.846597
O  -3.536885 0.140801 -1.519184
O  1.710312 0.131619 1.170994
C  -4.887495 -0.28068 1.089252
C  4.67364 -0.015773 1.109222
C  -5.759998 0.990261 1.049644
C  4.930235 1.26638 1.926621
C  -1.631079 -2.297082 -1.410422
C  1.155783 -2.335616 -0.709842
C  -1.185712 1.612095 0.561386
C  2.24806 1.733404 -1.827301
C  -0.8603 2.797786 1.464099
C  2.800737 2.924355 -2.60317
H  -5.417746 -1.158379 0.681118
H  -4.552909 -0.520927 2.112644
H  5.432933 -0.164139 0.322639
H  4.653842 -0.915613 1.748016
H  -5.221308 1.85376 1.474045
H  -6.056816 1.239286 0.01594
H  -6.67837 0.825946 1.641223
H  4.959531 2.154356 1.273567
H  4.14646 1.419338 2.688797
H  5.901678 1.182794 2.445653
H  -2.402095 -1.810278 -2.034837
H  -1.614497 -3.38551 -1.570762
H  0.896555 -1.963394 0.295988
H  1.088681 -3.432959 -0.767992
H  -1.20943 1.89808 -0.507825
H  -0.464452 0.787773 0.709914
H  1.322421 1.989767 -1.278601
H  2.042443 0.867549 -2.48529
H  -1.571753 3.627378 1.310225
H  -0.890465 2.49324 2.523929
H  0.161893 3.15593 1.241998
H  3.009837 3.771142 -1.927394
H  3.733828 2.651609 -3.124677
H  2.061599 3.252295 -3.35718
