program: Gaussian 09
title: 000088452
version: EM64L-G09RevD.01
frameworkgroup: C1[X(C11H12O3)]
method: RPBEPBE
basis: SDD
operation: Freq
keyword: #pfreq=noraman
keyword: PBEPBE/SDD
title: #p freq=noraman PBEPBE/SDD
converged: YES YES NO NO
title: Mulliken charges:
elementType: O O O C C C C C C C C C C C H H H H H H H H H H H H
charge: -0.263097 -0.198334 -0.153619 -0.583970 0.487416 -0.254677 -0.407046 -0.375277 -0.222745 -0.231819 -0.240563 0.204479 0.126506 -0.722427 0.228844 0.215289 0.239949 0.247682 0.230495 0.227892 0.227614 0.228342 0.230681 0.247165 0.261238 0.249981
chargesum: 0.00000
title: Mulliken charges with hydrogens summed into heavy atoms:
elementType: O O O C C C C C C C C C C C
charge: -0.263097 -0.198334 -0.153619 -0.139837 0.487416 0.232954 -0.176551 -0.147385 0.004869 -0.003478 -0.009881 0.204479 0.126506 0.035957
polarizability: 1.36732629e+02 5.16605503e+00 1.30788164e+02 -1.10027768e+01 5.76321750e+00 9.56621232e+01
1716.lowfreq: -6.8419 -0.0008 -0.0005 0.0002 4.0681 8.1138 19.3753 25.0380 32.9898
frequency: 18.0965 24.9741 32.9603 38.3808 109.2111 116.2163 147.3846 181.6260 225.4032 271.4685 343.5025 377.2722 381.5911 403.1536 423.5405 455.3351 491.0163 563.5392 607.4089 617.9190 679.2773 705.2018 753.8816 764.5317 782.8939 838.4990 854.4503 911.7126 951.5127 969.7022 976.9030 980.9854 991.6631 995.8373 1018.5645 1028.1566 1049.0548 1085.7426 1092.1732 1172.9333 1182.4188 1188.7718 1203.2558 1216.9212 1228.7016 1325.8203 1336.3846 1352.5826 1374.4900 1383.7561 1438.4476 1440.3185 1441.3103 1459.3275 1464.6356 1485.9435 1594.7881 1615.4292 1627.9723 1647.1400 2992.4537 2995.5719 3009.0232 3055.0839 3076.4087 3080.1732 3113.4601 3121.3014 3130.0270 3134.6454 3145.6122 3163.7873
redmass: 5.1249 4.1496 5.0728 6.5859 5.2165 4.6874 1.0299 3.4687 3.5956 4.9256 2.2161 4.9823 3.7770 2.8184 4.3423 4.1385 3.9827 2.9471 4.2038 6.2666 3.7378 1.7803 3.0962 1.8398 4.4862 4.8080 1.2490 1.4486 2.2766 2.1164 1.3962 2.2031 5.1206 1.3206 1.8114 2.1331 2.2420 5.7521 1.6179 1.0583 1.1868 1.1191 3.3219 2.2445 1.2416 1.3496 1.4346 1.3519 1.2372 7.3079 1.0708 1.1722 1.7759 1.1122 1.0896 2.3037 6.0673 6.1731 11.4671 9.5692 1.0364 1.0602 1.0586 1.1011 1.0954 1.1075 1.0878 1.0861 1.1019 1.0910 1.0960 1.1015
irintensity: 1.9481 3.5370 0.9992 0.3222 0.0857 4.4648 0.3898 2.8942 1.8499 2.6213 0.2569 0.8303 5.1369 0.0240 9.8550 0.4999 10.4621 16.8113 17.9031 0.0962 5.4607 55.9482 20.6652 29.3243 10.3340 6.5477 0.2068 2.0925 11.7180 6.5806 0.0621 8.7217 0.7695 0.1896 3.4310 5.2246 25.2478 291.0075 11.2033 0.1456 1.5648 0.3543 93.8794 5.9118 4.4774 1.1183 2.4011 12.0884 55.5510 0.4583 50.4618 17.8986 11.0002 14.7980 7.6399 16.4503 1.2753 7.7876 251.8925 33.1635 0.3189 17.3104 26.4756 11.4789 4.5790 30.2999 9.4598 5.0959 14.4974 12.7066 43.0145 18.2524
temp: 298.150 k
press: 1.00000 atm
elementType: 8 8 8 6 6 6 6 6 6 6 6 6 6 6 1 1 1 1 1 1 1 1 1 1 1 1
symmnumber: 1
zpe: 535087.5 jmol-1
zpe.correction: 0.203804 hartree
zpe.thermalcorrener: 0.217663 hartree
zpe.thermalcorrenthalpy: 0.218607 hartree
zpe.thermalcorrgfe: 0.159680 hartree
zpe.sumelectzpe: -650.998752 hartree
zpe.sumelectthermal: -650.984894 hartree
zpe.sumelectthermalent: -650.983950 hartree
zpe.sumelectthermalfe: -651.042877 hartree
dipole: 4.5068 0.1772 2.4505
dipole: 5.1330
quadrupole: -102.6338 -73.3983 -81.2977
quadrupole: -2.4304 -13.4413 -0.8982
quadrupole: -16.8572 12.3783 4.4789 -2.4304 -13.4413 -0.8982
hfenergy: -651.2025566 hartree
pointgroup: C01 [X(C11H12O3)]
dipole: 1.746827 -0.0218917 1.013085 debye
dipolederiv: -1.3559218 0.2416464 -0.384947 0.4298066 -0.5373727 0.0524896 -0.4708635 -0.0160771 -0.5000101 -0.6210708 0.0733317 -0.0975224 -0.2205925 -0.5683608 -0.2891468 -0.3978746 -0.1330366 -0.5538872 -0.7718147 0.0771505 -0.1762598 0.1690297 -0.4637424 -0.04045 -0.1908416 -0.0591749 -0.3895528 -0.0318986 -0.0419197 -0.0305939 0.0061728 0.0964093 0.0049272 -0.0859825 -0.0439604 0.1172009 0.1069154 0.1485312 -0.0583345 0.1913049 0.1157597 -0.0371298 -0.0955878 -0.0120547 -0.0590003 0.6933682 -0.1380136 0.0612942 -0.35577 0.3753782 -0.1085335 0.049116 -0.0042458 0.2545947 -0.1656649 -0.0358704 -0.0443291 -0.0410301 0.0159054 0.08114 -0.0282279 0.1087195 -0.0810648 -0.0695294 -0.0237818 -0.1153532 -0.0613551 -0.1237771 0.048175 -0.1217752 0.0253459 -0.0309865 -0.0189497 0.0021174 -0.1273365 -0.0088458 -0.0458784 0.0398974 -0.1369653 0.0283848 0.0123417 -0.1007614 0.0030257 -0.0602294 0.033503 0.0800613 0.0863498 -0.0580073 0.0876275 -0.0433449 -0.0783386 0.0899311 -0.0705751 0.087122 0.0189837 -0.0322858 -0.0612204 -0.0235217 -0.1032409 1.2981757 -0.1427969 0.4591797 0.0904122 0.4857572 0.2261398 0.8488084 0.0818072 0.722857 0.8356791 -0.0801126 0.2698173 -0.173213 0.7502549 0.2816971 0.2934106 0.2792159 0.4574572 -0.1713623 -0.1452738 -0.1735044 -0.0988627 -0.1820538 -0.1857062 -0.1824265 -0.1975735 -0.1976362 0.0461075 -0.0407502 0.0644823 -0.0464607 0.0639079 -0.0620806 0.0507377 0.0299949 -0.1077815 -0.0256608 0.0959745 -0.0055578 0.0324423 -0.1048076 0.0139584 0.0210115 -0.042606 0.0868526 -0.1214714 -0.1151988 0.0200759 -0.0005174 -0.0878206 0.0492651 0.0233239 0.0347263 0.0691819 0.0096215 0.0576092 0.0067919 0.0863122 0.0404336 0.0416822 0.0448298 -0.0102375 -0.0782385 0.1305992 -0.0115967 0.0269863 0.0042573 -0.0905987 -0.0891159 0.0292689 -0.0754792 0.0754446 0.0307435 0.0071459 0.1387748 0.0040161 0.0816968 -0.0071233 0.1582723 -0.0188143 0.0078543 0.0188703 -0.0016464 0.134151 0.0024867 0.0840443 -0.0330128 0.147859 -0.0250933 0.0007089 0.1223259 0.0072432 0.0427699 -0.0150182 -0.0789579 -0.0951529 0.0414166 -0.098864 0.0683977 0.0484704 -0.1065494 0.0689922 -0.1159221 -0.0342718 0.0343937 0.0760951 0.0363967 0.10166 0.1590402 0.0061016 -0.0249958 -0.0187409 0.0514203 0.0897088 -0.0444564 0.0688833 -0.0043544 0.0074219 -0.0349903 0.0646161 -0.0597721 0.1131715 -0.0176464 0.0979294 0.0051004 0.0683291 0.0251056 0.1086922 0.0116075 0.079235 -0.0555423 -0.0524401 -0.0078504 -0.0254631 0.1062176 unknown
polarizability: 136.7517421|6.9221628|128.4946834|-9.320432|10.9880123|97.9364902 unknown
InChI: InChI=1S/C11H12O3/c1-9(12)11(13)14-8-7-10-5-3-2-4-6-10/h2-6H,7-8H2,1H3
charge 0 multiplicity 1
26 atoms
O  -1.356861 -0.772107 0.389775
O  -2.910071 -1.484825 -1.202029
O  -4.384455 0.885217 -0.523191
C  0.758903 -1.850249 0.955111
C  1.64544 -0.688358 0.52634
C  -0.521591 -1.983193 0.117882
C  2.57711 -0.843763 -0.532069
C  1.539314 0.577659 1.156135
C  3.379757 0.239616 -0.955634
C  2.341698 1.66337 0.737852
C  3.264173 1.498256 -0.321314
C  -2.522039 -0.64847 -0.361967
C  -3.260606 0.67603 -0.012724
C  -2.562771 1.640728 0.923496
H  0.47416 -1.751929 2.018743
H  1.307215 -2.807034 0.853531
H  -1.111667 -2.874862 0.398545
H  -0.314302 -2.023237 -0.966554
H  2.68079 -1.819696 -1.023864
H  0.825109 0.710222 1.977757
H  4.096451 0.101292 -1.772995
H  2.250839 2.634111 1.238467
H  3.888333 2.338349 -0.645589
H  -2.415496 1.168665 1.91246
H  -1.5531 1.882638 0.544781
H  -3.164132 2.556369 1.030057
