program: Gaussian 09
title: 000088445
version: EM64L-G09RevD.01
frameworkgroup: C1[X(C6H14N2S)]
method: RPBEPBE
basis: SDD
operation: Freq
keyword: #p
keyword: freq=noraman
keyword: PBEPBE/SDD
title: #p freq=noraman PBEPBE/SDD
converged: YES YES NO NO
title: Mulliken charges:
elementType: S N N C C C C C C H H H H H H H H H H H H H H
charge: 0.131108 -0.591128 -0.305733 -0.336657 -0.339897 -0.350422 -0.694103 -0.691822 -0.095749 0.188777 0.187899 0.213790 0.211186 0.196426 0.196615 0.255849 0.275128 0.210271 0.210330 0.218234 0.330407 0.325684 0.253806
chargesum: 0.00000
title: Mulliken charges with hydrogens summed into heavy atoms:
elementType: S N N C C C C C C
charge: 0.131108 0.064964 -0.051926 0.040019 0.085079 0.042619 -0.163125 -0.052987 -0.095749
polarizability: 1.39264404e+02 -1.44212220e+00 9.64299918e+01 -4.28627631e+00 -1.46467035e+00 6.45520374e+01
1716.lowfreq: 0.0020 0.0021 0.0023 1.0864 6.7481 17.3503 28.7002 51.3722 61.5639
frequency: 28.3767 51.1448 61.5141 70.9245 109.4302 135.5658 161.2028 221.0047 226.1656 323.2272 360.6267 397.7428 411.5362 450.9874 472.4683 575.5886 597.0744 707.5805 718.9908 732.8375 763.7178 837.2488 895.3945 949.7311 1005.7812 1035.9814 1058.5176 1066.1170 1072.6932 1079.7109 1111.9239 1197.3346 1227.1500 1255.0877 1258.3085 1284.4609 1289.4893 1294.3022 1337.1808 1353.5497 1390.7325 1453.5917 1466.9512 1470.6927 1477.1023 1480.0915 1489.0798 1591.7283 1666.9600 2958.7715 2970.7941 2973.7699 2984.0731 2999.3111 3002.5754 3023.9651 3045.2003 3070.3148 3073.6105 3083.4489 3453.7477 3544.4698 3700.3614
redmass: 3.8678 1.8810 3.7656 3.9262 1.8269 2.2223 3.9957 4.1836 1.1538 3.2518 1.2087 3.9832 3.6616 2.0943 1.6944 3.7028 4.2990 5.9288 1.1552 1.0701 1.1069 1.1881 1.8216 1.1960 4.1441 1.3037 2.7982 1.1599 2.4190 1.9819 2.3015 1.6037 1.2611 1.3988 2.0393 1.3829 1.0504 1.1326 1.4060 1.5968 1.2155 1.0845 1.0663 1.0728 1.0428 1.0695 1.0908 1.2120 5.1024 1.0586 1.0590 1.0367 1.0593 1.0986 1.0563 1.1025 1.1041 1.1010 1.0992 1.1085 1.0780 1.0447 1.1046
irintensity: 0.7697 1.2604 1.4111 1.3545 0.7912 0.3893 2.1551 0.7630 0.0256 1.4819 72.3699 2.2337 13.9556 86.5347 145.0309 50.6644 79.6024 4.7476 63.3681 10.7131 0.3423 2.7475 2.7084 0.0937 2.7766 178.0004 7.0984 5.7446 0.1155 10.7108 14.5989 0.1552 25.3597 49.4081 225.9718 16.8395 0.5388 0.6581 2.6613 0.4736 11.2967 5.8990 0.8793 1.6716 12.6465 1.8547 19.2292 79.5287 270.6297 5.5842 44.8094 35.1052 31.6295 0.7074 29.3553 8.8450 30.2249 75.2629 51.6243 52.2605 8.4360 53.3241 34.9484
temp: 298.150 k
press: 1.00000 atm
elementType: 16 7 7 6 6 6 6 6 6 1 1 1 1 1 1 1 1 1 1 1 1 1 1
symmnumber: 1
zpe: 517737.9 jmol-1
zpe.correction: 0.197196 hartree
zpe.thermalcorrener: 0.209535 hartree
zpe.thermalcorrenthalpy: 0.210479 hartree
zpe.thermalcorrgfe: 0.157075 hartree
zpe.sumelectzpe: -743.849078 hartree
zpe.sumelectthermal: -743.836739 hartree
zpe.sumelectthermalent: -743.835795 hartree
zpe.sumelectthermalfe: -743.889199 hartree
dipole: 1.3404 -0.9889 0.5450
dipole: 1.7526
quadrupole: -57.9552 -67.4308 -65.6775
quadrupole: 8.0933 -3.7355 -2.2095
quadrupole: 5.7326 -3.7429 -1.9897 8.0933 -3.7355 -2.2095
hfenergy: -744.0462737 hartree
pointgroup: C01 [X(C6H14N2S1)]
dipole: 0.5486263 -0.4084869 0.0871793 debye
dipolederiv: -0.7452365 0.1785406 0.1306938 0.3591196 -0.3393463 -0.0713148 0.2409986 -0.0861457 -0.1609553 -1.1431168 -0.4992284 -0.0171544 -0.2969014 -0.5430787 0.0233729 0.0291149 0.0432119 -0.7262015 -0.6163082 0.1984562 0.0039528 0.1491451 -1.2617576 -0.1530596 -0.0040579 -0.2166528 -0.4994672 -0.0920759 -0.0022942 -0.003485 0.1330039 0.0979942 -0.0334098 0.0360252 -0.0301215 0.1815294 -0.0641396 -0.0007618 0.0014866 -0.1839628 0.0808902 -0.015782 -0.064875 -0.0181748 0.1569518 0.0526031 -0.0144576 -0.0063819 -0.108667 0.1010948 -0.0206668 -0.0353766 -0.0234906 0.1682887 0.3772956 0.1062301 0.036806 0.2058518 0.0763828 -0.0574253 0.0388742 -0.0411835 0.1354036 -0.086203 -0.0488968 -0.0173552 0.0039665 0.0516607 -0.0158557 -0.0028629 -0.0152982 0.0905007 1.5881484 0.1099372 -0.3097936 -0.1327758 1.4007067 0.2283668 -0.4502914 0.2305978 0.2450146 0.0412261 0.0131098 0.0213267 -0.0029053 0.0263304 -0.0789201 0.0148886 -0.0992469 -0.1526526 0.0424631 0.0175135 -0.0083275 0.0018749 -0.1157376 0.1074057 -0.0115216 0.1271679 -0.0126762 0.061813 -0.0004807 -0.0124267 0.0228264 -0.0800065 0.0983588 -0.0055726 0.1032228 0.00045 0.06699 -0.0063917 0.0101369 0.0163847 0.0393534 -0.071551 0.0198227 -0.0778855 -0.1211776 0.0283092 -0.0268202 0.0104916 0.011096 -0.1253632 0.1110257 -0.0050436 0.1357745 -0.0061737 0.0284329 -0.0111018 -0.017785 0.0097442 0.0298002 -0.0863028 0.0161685 -0.1115299 -0.1619335 -0.0165627 -0.018148 -0.0108358 -0.0469748 -0.1026187 0.0875753 -0.0479642 0.0687606 0.0150644 -0.0156101 -0.0212939 0.0010841 -0.0670478 0.0173087 -0.0728716 0.0045591 -0.060622 -0.0825883 0.0856764 0.0126394 -0.0261138 -0.0490884 -0.0988386 0.1160985 0.0047843 0.1357812 -0.0092354 0.0851554 -0.0002853 0.0373692 -0.0346295 0.0484543 -0.0776718 -0.0227007 -0.0956897 -0.1553786 -0.1999647 0.0799116 0.019882 0.1113409 0.0274675 -0.0202888 0.0276865 -0.021014 0.0953722 0.1912397 0.0206084 0.0507424 0.004267 0.1610762 -0.0210766 0.0820964 -0.0235209 0.3784231 0.2515138 0.0686914 0.0452007 0.068819 0.180218 -0.0108668 0.0420432 0.0134622 0.3799659 0.0783508 -0.1554777 0.0604861 -0.1744872 0.3280093 0.0348598 0.0932042 0.0625971 0.2414755 unknown
polarizability: 138.9937885|2.0226369|94.7903015|-6.1178822|7.096505|66.4623436 unknown
InChI: InChI=1S/C6H14N2S/c1-2-3-4-5-9-6(7)8/h7H,2-5,8H2,1H3
charge 0 multiplicity 1
23 atoms
S  -1.628081 -1.007509 -0.387729
N  -4.202767 -0.706517 0.357252
N  -3.073157 1.344748 0.459028
C  2.358452 0.334637 0.097486
C  1.144194 -0.575852 -0.205897
C  3.709876 -0.390088 -0.101928
C  -0.190184 0.160353 0.004386
C  4.924474 0.510654 0.208524
C  -3.064312 0.066617 0.211062
H  2.293581 0.704465 1.141908
H  2.325109 1.23125 -0.556027
H  1.180168 -1.469302 0.447905
H  1.208942 -0.940077 -1.250389
H  3.739028 -1.289409 0.54637
H  3.775849 -0.756723 -1.146428
H  -0.262614 1.033801 -0.668601
H  -0.304027 0.491895 1.051313
H  4.938141 1.400626 -0.448733
H  4.896761 0.867677 1.255373
H  5.876644 -0.031348 0.06198
H  -5.068211 -0.230642 0.605643
H  -4.162125 -1.721842 0.349787
H  -2.208043 1.860986 0.238315
