program: Gaussian 09
title: 000088444
version: EM64L-G09RevD.01
frameworkgroup: C1[X(C2H2O2S2)]
method: RPBEPBE
basis: SDD
operation: Freq
keyword: #pfreq=noraman
keyword: PBEPBE/SDD
title: #p freq=noraman PBEPBE/SDD
converged: NO NO NO NO
title: Mulliken charges:
elementType: S S O O C C H H
charge: 0.108017 0.075556 -0.143209 -0.108749 -0.139485 -0.099272 0.144997 0.162146
chargesum: 0.00000
title: Mulliken charges with hydrogens summed into heavy atoms:
elementType: S S O O C C
charge: 0.253014 0.237702 -0.143209 -0.108749 -0.139485 -0.099272
polarizability: 9.75832784e+01 -1.10121863e+01 6.34726359e+01 2.61496404e-02 1.35910060e-02 2.19864813e+01
1716.lowfreq: -5.4807 -0.0034 0.0013 0.0015 5.8515 10.3860 65.3278 191.8507 271.3873
frequency: 65.2799 191.8507 271.3871 350.3545 397.8577 412.3169 435.0607 441.5129 579.8613 687.6921 693.5654 820.9291 911.5717 1060.9462 1595.5681 1622.9499 2381.7602 2419.5392
redmass: 16.8135 10.9476 10.5707 1.8496 18.9583 1.3469 1.4585 9.5597 6.2125 11.1518 3.5700 1.4067 1.4415 4.9960 12.5462 12.7417 1.0376 1.0376
irintensity: 3.0600 12.5237 6.0410 0.5145 0.4086 66.2143 7.2882 4.4090 13.2491 0.1889 135.4228 99.2031 86.3806 0.9287 40.6017 301.3631 5.7409 5.4757
temp: 298.150 k
press: 1.00000 atm
elementType: 16 16 8 8 6 6 1 1
symmnumber: 1
zpe: 91753.6 jmol-1
zpe.correction: 0.034947 hartree
zpe.thermalcorrener: 0.041696 hartree
zpe.thermalcorrenthalpy: 0.042640 hartree
zpe.thermalcorrgfe: 0.003289 hartree
zpe.sumelectzpe: -1023.503879 hartree
zpe.sumelectthermal: -1023.497131 hartree
zpe.sumelectthermalent: -1023.496187 hartree
zpe.sumelectthermalfe: -1023.535537 hartree
dipole: 1.1204 2.2396 -0.0066
dipole: 2.5042
quadrupole: -43.8784 -55.5276 -49.5935
quadrupole: -0.3375 0.0160 -0.0004
quadrupole: 5.7881 -5.8611 0.0730 -0.3375 0.0160 -0.0004
hfenergy: -1023.5388266 hartree
pointgroup: C01 [X(C2H2O2S2)]
dipole: 0.8423044 -0.4768272 0.1840158 debye
dipolederiv: -0.2011569 -0.4741214 0.1092238 -0.5535115 -0.3259165 0.0264935 0.1301154 0.0327829 -0.0641871 -0.1863308 -0.4243017 0.1033145 -0.360453 -0.5163057 0.0768722 0.0868324 0.072194 -0.1276103 -0.5391824 0.1397725 -0.0575121 -0.2496139 -1.0011549 0.1767171 0.0414723 0.2034076 -0.2761359 -0.4539514 0.1250611 -0.0471119 -0.159307 -0.9165846 0.1608461 0.0253777 0.1807852 -0.2902074 0.7085478 0.2729994 -0.0263247 0.6393299 1.2632199 -0.243126 -0.1192483 -0.2689967 0.1714541 0.510076 0.1977434 -0.0252908 0.5161309 1.3676123 -0.2718616 -0.106868 -0.2937791 0.2333295 0.0096235 0.0326529 -0.0200119 0.1162995 0.0023396 0.0526766 -0.0410118 0.0468477 0.1652508 0.1523742 0.1301939 -0.0362869 0.0511252 0.1267899 0.0213822 -0.0166698 0.0267584 0.1881064 unknown
polarizability: 77.5457947|20.3957474|80.2192996|-1.2254635|-13.3193564|25.2773013 unknown
InChI: InChI=1S/C2H2O2S2/c3-1(5)2(4)6/h5-6H
charge 0 multiplicity 1
8 atoms
S  1.779395 1.41945 0.00423
S  -1.813463 -1.258645 0.426092
O  1.249483 -1.209002 0.627374
O  -1.155057 1.317666 -0.186108
C  0.783336 -0.092231 0.314754
C  -0.731433 0.19075 0.13344
H  2.979602 0.765701 0.251189
H  -0.759763 -2.119689 0.720929
