program: Gaussian 09
title: 000088386
version: EM64L-G09RevD.01
frameworkgroup: C1[X(C8H12O4)]
method: RPBEPBE
basis: SDD
operation: Freq
keyword: #pfreq=noraman
keyword: PBEPBE/SDD
title: #p freq=noraman PBEPBE/SDD
converged: NO YES NO NO
title: Mulliken charges:
elementType: O O O O C C C C C C C C H H H H H H H H H H H H
charge: -0.270935 -0.254700 -0.250597 -0.248487 -0.264626 -0.267356 0.171657 0.340827 0.296134 -0.753882 -0.748387 -0.628391 0.227546 0.247419 0.228114 0.246721 0.239156 0.243548 0.215331 0.250358 0.248861 0.246475 0.229934 0.255279
chargesum: 0.00000
title: Mulliken charges with hydrogens summed into heavy atoms:
elementType: O O O O C C C C C C C C
charge: -0.270935 -0.254700 -0.250597 -0.248487 0.210339 0.207479 0.171657 0.340827 0.296134 -0.055846 -0.002694 -0.143177
polarizability: 1.37117145e+02 4.38545521e-01 9.19748868e+01 1.04466777e+01 -7.27508890e-01 7.46069760e+01
1716.lowfreq: -39.2055 -10.5010 -0.0006 -0.0001 0.0003 1.7019 6.4161 16.8842 22.7251
frequency: -39.2035 16.4258 22.6882 42.5547 65.5288 120.3280 142.0654 176.3313 180.0610 186.3146 262.7103 286.2212 366.5015 393.5685 397.2259 433.8458 483.5857 565.5792 575.7751 611.9881 631.8847 773.9348 784.5409 792.6190 861.1234 918.7164 949.9572 979.8204 990.2773 1008.1065 1012.4618 1036.7641 1043.0232 1053.7837 1110.3443 1115.0670 1202.4169 1205.6900 1246.0132 1288.4603 1352.2636 1379.7853 1387.0433 1397.5333 1416.0854 1453.0350 1453.6823 1453.9625 1456.2211 1457.1271 1472.6620 1609.9600 1653.6948 1654.2950 2991.0123 3008.9537 3011.4550 3020.8341 3074.8568 3078.8215 3089.4647 3096.8285 3099.7214 3104.7230 3144.6839 3216.8662
redmass: 1.0407 4.2536 7.3636 3.9745 4.5088 4.1550 4.8081 1.1032 2.6362 5.9557 2.5109 3.0976 2.7675 3.4344 3.2504 3.4460 3.7480 3.0180 3.9831 4.4690 1.5379 2.6277 2.1569 4.9382 4.0199 4.8919 2.0213 1.8433 1.3177 1.7498 1.8799 2.3756 1.6759 1.5023 2.2778 5.2445 1.1278 3.3117 1.0940 3.3378 1.3455 1.4084 1.4580 1.1664 1.2507 1.0659 1.0740 1.0478 1.0723 1.0510 1.0617 11.3169 6.6664 6.6536 1.0362 1.0371 1.0573 1.0606 1.0971 1.1058 1.1050 1.0973 1.1006 1.0621 1.1009 1.1157
irintensity: 1.1049 1.1706 1.7522 0.6802 2.2405 2.3958 6.1857 1.2710 10.0473 1.9563 7.6384 4.6560 1.8502 1.2431 4.4460 18.1523 4.1482 2.7644 4.6363 3.4803 9.9767 10.5007 11.5325 4.1108 6.9772 69.2736 24.3651 22.3311 58.0253 11.4652 61.1815 40.6660 9.4235 6.4634 42.4893 468.1379 9.5999 317.0710 2.8796 95.1582 0.3209 24.7321 29.0293 22.9538 10.7048 34.7045 4.9652 19.8414 16.7254 19.1390 35.8958 151.7245 128.2110 82.4209 15.4698 1.5647 3.3636 29.1459 14.7139 11.5951 24.3053 8.2806 25.6868 3.8344 10.3916 5.2969
temp: 298.150 k
press: 1.00000 atm
elementType: 8 8 8 8 6 6 6 6 6 6 6 6 1 1 1 1 1 1 1 1 1 1 1 1
symmnumber: 1
zpe: 495671.9 jmol-1
zpe.correction: 0.188791 hartree
zpe.thermalcorrener: 0.202086 hartree
zpe.thermalcorrenthalpy: 0.203030 hartree
zpe.thermalcorrgfe: 0.145846 hartree
zpe.sumelectzpe: -611.996163 hartree
zpe.sumelectthermal: -611.982868 hartree
zpe.sumelectthermalent: -611.981924 hartree
zpe.sumelectthermalfe: -612.039109 hartree
dipole: 0.3089 1.6210 0.5027
dipole: 1.7251
quadrupole: -75.4483 -66.8582 -72.4581
quadrupole: 5.8471 -10.8865 2.9114
quadrupole: -3.8601 4.7300 -0.8699 5.8471 -10.8865 2.9114
hfenergy: -612.1849547 hartree
pointgroup: C01 [X(C8H12O4)]
dipole: -0.1209376 -0.6479373 0.1617894 debye
dipolederiv: -1.6820528 -0.2046667 0.2198854 -0.2374391 -0.4866846 -0.0416191 0.273985 -0.0469858 -0.3392353 -1.4711628 0.4867959 0.0334581 0.5903563 -0.6048322 0.0992741 0.0341291 0.1068167 -0.4390101 -0.6956549 -0.0247878 0.0600274 0.122557 -0.842407 -0.2498957 0.1544142 -0.2157936 -0.4417247 -0.8366339 0.1246461 0.1259262 -0.0469741 -0.441654 0.2248508 0.4459345 0.0900329 -0.7024399 0.7144003 0.2156591 -0.0021648 0.4046322 0.3719054 -0.0514766 0.06813 -0.0382706 0.2802389 0.5125114 -0.1558363 0.1073387 -0.303893 0.4709176 -0.0534875 0.2773843 -0.1017987 0.2877338 1.9035184 0.2559909 -0.2508696 0.1729589 0.9684263 0.2772361 -0.36841 0.2537811 0.410614 -0.2697781 -0.3208882 -0.0920181 -0.3069463 0.0314469 0.1131581 -0.0764955 0.114888 0.02307 1.7752378 -0.547217 -0.1930255 -0.4410464 0.6669944 -0.4035315 -0.5350065 -0.2557166 0.8769341 -0.0613942 0.0835154 0.0629049 0.0720097 -0.0518418 -0.0718377 0.06627 -0.0706167 0.0210601 -0.0729003 0.0622117 -0.0343402 0.1275688 -0.1682867 0.1925087 -0.0980305 0.2179435 -0.2052566 -0.0429903 0.1748205 0.0015564 -0.0098358 -0.0678012 0.1079357 -0.0793643 0.0661061 -0.2842171 -0.0569503 0.0493434 -0.0393236 -0.0670065 -0.066397 0.069457 -0.0421007 0.0815439 0.0395162 0.0055159 -0.0349102 0.013561 -0.1199781 0.0472493 0.0014257 -0.0301816 -0.0541505 -0.0697673 -0.0617801 -0.086964 -0.0050308 0.0077577 -0.085787 0.0280954 -0.0776668 0.0238978 0.0723178 0.0582849 0.0296805 -0.0202556 0.0846348 0.0105882 -0.06858 -0.088739 0.0019176 -0.066143 0.0912703 -0.0002133 0.0863344 0.014394 0.0686657 0.0649441 0.096308 0.0242922 -0.0665969 -0.0052302 0.0838153 -0.0823455 0.0889932 0.0741634 0.0012291 -0.0901533 0.0386801 0.029119 -0.0340565 -0.1579493 -0.0308006 -0.0854443 -0.0613074 -0.0520951 0.0012701 -0.0308581 0.0981347 0.0283199 -0.102006 -0.0180497 -0.0764856 0.0027901 0.025041 -0.0103895 -0.0059999 0.1252779 0.1228575 0.0354549 -0.0034637 0.0046037 0.0670588 -0.0918081 -0.011129 -0.0591117 -0.0353299 -0.0666196 0.079819 0.024045 0.0616614 0.0873609 0.0157817 0.0561724 -0.0023749 0.0892102 0.0377918 -0.0783534 -0.0012658 -0.1090059 -0.0171727 -0.052759 -0.0116483 -0.0589189 0.147713 0.107496 0.0320396 0.0379161 0.0519274 0.0266046 -0.0838471 0.0453176 -0.079304 0.1487811 unknown
polarizability: 137.4365198|1.1937957|91.860729|-9.3693366|1.6077927|74.4017593 unknown
InChI: InChI=1S/C8H12O4/c1-6(2)8(10)12-5-4-11-7(3)9/h1,4-5H2,2-3H3
charge 0 multiplicity 1
24 atoms
O  -0.789679 0.291275 -0.263088
O  2.083445 0.08885 0.421335
O  -2.516349 1.513396 0.71193
O  3.992963 0.05679 -0.912746
C  0.113292 1.438159 0.012199
C  1.486367 1.07845 -0.515862
C  -2.118467 0.458714 0.157485
C  -2.940033 -0.757323 -0.152989
C  3.373989 -0.352886 0.094323
C  -2.273179 -1.938943 -0.825671
C  3.859441 -1.360407 1.112163
C  -4.255464 -0.722545 0.198032
H  -0.28128 2.334629 -0.501102
H  0.12959 1.637379 1.097903
H  2.136517 1.972092 -0.553776
H  1.436009 0.639717 -1.527572
H  -1.851872 -1.651309 -1.805649
H  -1.428202 -2.312764 -0.220417
H  -2.994017 -2.759945 -0.977332
H  3.172737 -2.223589 1.149712
H  3.872617 -0.908786 2.119169
H  4.869817 -1.699611 0.843385
H  -4.918906 -1.5725 0.006086
H  -4.678636 0.163358 0.683983
