program: Gaussian 09
title: 000088388
version: EM64L-G09RevD.01
frameworkgroup: C1[X(C10H20N2O)]
method: RPBEPBE
basis: SDD
operation: Freq
keyword: #p
keyword: freq=noraman
keyword: PBEPBE/SDD
title: #p freq=noraman PBEPBE/SDD
converged: YES YES NO NO
title: Mulliken charges:
elementType: O N N C C C C C C C C C C H H H H H H H H H H H H H H H H H H H H
charge: -0.282127 -0.081884 -0.394928 0.370326 -0.452187 -0.410784 -0.717712 -0.749428 -0.604896 -0.608056 0.248638 -0.225024 -0.491645 0.204336 0.211103 0.228193 0.247498 0.219105 0.203686 0.228080 0.219279 0.206498 0.214899 0.291559 0.219074 0.190349 0.213228 0.223172 0.212845 0.190460 0.205058 0.220148 0.251140
chargesum: 0.00000
title: Mulliken charges with hydrogens summed into heavy atoms:
elementType: O N N C C C C C C C C C C
charge: -0.282127 -0.081884 -0.103369 0.370326 -0.036749 0.064907 -0.066841 -0.108752 0.017755 0.018421 0.248638 -0.019967 -0.020358
polarizability: 1.78539981e+02 1.10047448e-01 1.04333750e+02 -8.63794596e+00 -6.47604473e+00 1.08305057e+02
1716.lowfreq: -28.1730 -10.1066 -0.0006 0.0003 0.0005 9.5287 20.2485 37.2807 45.6299
frequency: -5.2544 36.8844 45.5587 57.3385 103.5450 113.7817 141.3459 163.1160 175.0408 196.9960 219.4263 222.1186 245.7154 251.5759 269.1414 297.7188 322.9315 375.3244 387.3334 418.1169 449.8760 479.5740 495.4047 554.9331 596.4363 634.0991 728.0254 781.1455 811.3247 832.9852 874.0963 895.1040 928.9499 941.3593 978.8644 983.1331 992.0301 1017.2449 1053.6098 1060.9302 1067.2746 1068.3664 1098.6402 1132.5705 1150.5220 1181.0714 1192.6964 1204.8619 1251.5140 1288.4737 1307.1193 1326.4511 1339.3629 1356.6337 1361.7698 1369.9749 1391.7385 1404.5326 1427.0778 1427.4885 1439.8905 1446.9072 1456.4429 1458.6463 1469.3831 1472.7144 1478.6962 1483.8402 1490.7181 1498.7634 1517.4326 1598.8100 1649.2785 2857.3601 2869.7911 2931.6950 2957.6296 2961.9515 2964.5474 2974.1722 2993.5962 2996.0869 3050.1884 3053.7514 3057.6487 3063.6962 3067.7048 3070.6089 3079.4533 3090.0806 3108.2981 3216.8344 3549.5968
redmass: 3.1580 3.4247 3.5046 4.5455 2.5589 2.6531 2.4907 2.7845 1.3431 1.4612 1.0496 1.6319 1.4056 2.0334 2.4238 2.6087 3.5217 1.9691 2.1815 2.5316 1.7324 2.6169 1.7914 1.2724 3.0875 3.3491 3.5577 3.6695 3.4480 2.4613 2.4602 1.8311 1.5315 1.5714 1.3394 1.7689 1.1163 1.5080 1.7473 3.4129 1.6667 1.6078 1.2496 1.3419 1.8940 1.9313 2.2791 2.3292 2.1792 1.7974 1.4148 2.9128 1.3452 1.4254 1.4102 1.2402 1.2145 1.2062 1.0898 1.1097 1.0954 1.1154 1.0665 1.0603 1.1015 1.0590 1.1871 1.2848 1.1671 1.0865 1.0766 6.8834 4.6695 1.0537 1.0581 1.0591 1.0762 1.0788 1.0366 1.0362 1.0604 1.1015 1.0978 1.0956 1.0955 1.1013 1.0994 1.0994 1.0990 1.0719 1.0810 1.1163 1.0773
irintensity: 1.2600 1.2263 3.8831 8.1174 18.1886 0.2736 0.4404 1.1692 2.1857 3.6322 0.2894 1.2793 1.5373 0.7835 2.1021 0.6764 11.8290 4.2613 0.1331 1.0270 2.2933 6.8293 27.0576 68.5148 13.6260 0.8012 2.1337 26.9459 1.0587 2.2222 37.1505 8.3747 1.9564 1.8628 2.2202 1.0224 83.5933 0.6019 9.5540 4.5686 66.3165 41.2306 11.6589 1.6674 35.5275 3.2855 11.0654 95.0149 11.8562 10.1780 9.1589 56.7111 8.9152 18.7709 2.2885 22.8293 23.5348 37.1037 6.8250 13.6258 24.5769 14.1414 6.2544 7.6108 16.8400 5.4356 49.5696 146.6236 50.5689 17.4436 10.6846 102.8447 15.6745 106.1046 178.5617 37.6798 175.5057 30.5273 27.5392 32.2801 34.6440 30.3451 31.3358 35.8008 38.9842 10.8525 40.5376 46.2879 33.5698 12.6306 13.2302 8.5115 15.0753
temp: 298.150 k
press: 1.00000 atm
elementType: 8 7 7 6 6 6 6 6 6 6 6 6 6 1 1 1 1 1 1 1 1 1 1 1 1 1 1 1 1 1 1 1 1
symmnumber: 1
zpe: 752789.0 jmol-1
zpe.correction: 0.286722 hartree
zpe.thermalcorrener: 0.302546 hartree
zpe.thermalcorrenthalpy: 0.303490 hartree
zpe.thermalcorrgfe: 0.243693 hartree
zpe.sumelectzpe: -576.695494 hartree
zpe.sumelectthermal: -576.679671 hartree
zpe.sumelectthermalent: -576.678727 hartree
zpe.sumelectthermalfe: -576.738523 hartree
dipole: 1.1690 1.7585 -3.2034
dipole: 3.8368
quadrupole: -78.1241 -83.3015 -81.5059
quadrupole: -4.7500 6.3703 0.4316
quadrupole: 2.8531 -2.3243 -0.5288 -4.7500 6.3703 0.4316
hfenergy: -576.9822166 hartree
pointgroup: C01 [X(C10H20N2O1)]
dipole: -0.4418937 -0.4443773 -1.373261 debye
polarizability: 177.1822883|-6.9664743|102.9587797|11.4490739|4.6096284|111.0377198 unknown
InChI: InChI=1S/C10H20N2O/c1-6-9(13)11-7-10(2,3)8-12(4)5/h6,11H,1,7-8H2,2-5H3
charge 0 multiplicity 1
33 atoms
O  2.520368 0.590402 1.253678
N  -3.070832 0.687647 0.033288
N  1.368324 0.069705 -0.710851
C  -0.888486 -0.796892 0.098856
C  -2.227887 -0.269393 0.74792
C  0.038971 0.422984 -0.190871
C  -0.218618 -1.738787 1.131991
C  -1.177998 -1.578195 -1.207984
C  -3.97933 0.24585 -1.019543
C  -2.813428 2.122209 0.113711
C  2.527687 0.17949 0.049944
C  3.778343 -0.223009 -0.675241
C  4.991355 -0.166656 -0.06994
H  -2.841052 -1.169102 0.972405
H  -1.957307 0.181183 1.726808
H  -0.459491 1.094037 -0.915767
H  0.215518 0.986801 0.743141
H  0.720799 -2.163549 0.734694
H  -0.890838 -2.580712 1.386449
H  0.03133 -1.197955 2.063082
H  -1.609011 -0.925231 -1.988588
H  -0.254763 -2.037858 -1.611152
H  -1.894007 -2.400983 -1.021523
H  1.443504 -0.259342 -1.674662
H  -4.248858 -0.814547 -0.862238
H  -3.569711 0.334479 -2.055772
H  -4.916053 0.842128 -0.992767
H  -2.275001 2.355779 1.050182
H  -3.771644 2.683521 0.125414
H  -2.207625 2.535967 -0.729982
H  3.685807 -0.565607 -1.716227
H  5.912585 -0.455777 -0.586432
H  5.060351 0.178512 0.968376
