program: Gaussian 09
title: 000088324
version: EM64L-G09RevD.01
frameworkgroup: C1[X(C4H7NS2)]
method: RPBEPBE
basis: SDD
operation: Freq
keyword: #pfreq=noraman
keyword: PBEPBE/SDD
title: #p freq=noraman PBEPBE/SDD
converged: NO YES NO NO
title: Mulliken charges:
elementType: S S N C C C C H H H H H H H
charge: 0.210204 0.267932 0.034573 -0.677128 -0.395983 -0.451297 -0.819448 0.264618 0.281434 0.238282 0.237677 0.279734 0.285447 0.243956
chargesum: 0.00000
title: Mulliken charges with hydrogens summed into heavy atoms:
elementType: S S N C C C C
charge: 0.210204 0.267932 0.034573 -0.131076 0.079975 -0.451297 -0.010311
polarizability: 1.15270352e+02 1.26333262e+00 8.58371838e+01 4.46433908e-01 7.81309647e-01 4.50962463e+01
1716.lowfreq: -11.1223 -7.2655 -0.0037 -0.0034 0.0016 5.6982 71.9474 96.7580 115.8160
frequency: 71.9441 96.7568 115.8045 165.4060 213.3628 270.1779 405.2951 509.0704 539.3577 574.9851 651.1827 666.9417 826.2957 872.4523 934.9949 978.9185 981.6125 995.2314 1003.9791 1133.6901 1186.4432 1260.3008 1299.7326 1339.4669 1432.8370 1446.4945 1451.5386 1457.9713 1577.8649 2990.9851 3026.6442 3045.1299 3064.1056 3130.7681 3154.1884 3159.2238
redmass: 3.6279 1.1251 2.1835 3.5061 3.0258 7.9649 8.9484 8.8263 6.3750 9.0505 7.4298 3.0789 1.7594 6.3714 2.8816 1.1843 2.7082 1.3441 2.0264 1.2472 1.1411 1.1793 1.2546 1.1317 1.0530 1.0945 1.0563 1.1029 7.6258 1.0636 1.0276 1.0623 1.0948 1.1097 1.1048 1.1059
irintensity: 3.5723 1.3004 0.8681 2.9392 6.8541 6.6804 1.5719 1.2196 3.5848 17.1141 1.5826 0.7540 7.4091 164.1111 23.6158 7.7802 7.3332 19.9050 0.7563 1.4328 7.7452 7.9843 17.0199 3.3562 15.0196 4.4951 15.8808 1.0147 149.1995 47.0110 18.7849 18.1881 27.5063 14.3894 7.2339 9.9358
temp: 298.150 k
press: 1.00000 atm
elementType: 16 16 7 6 6 6 6 1 1 1 1 1 1 1
symmnumber: 1
zpe: 275327.4 jmol-1
zpe.correction: 0.104867 hartree
zpe.thermalcorrener: 0.113137 hartree
zpe.thermalcorrenthalpy: 0.114081 hartree
zpe.thermalcorrgfe: 0.070991 hartree
zpe.sumelectzpe: -1006.929071 hartree
zpe.sumelectthermal: -1006.920801 hartree
zpe.sumelectthermalent: -1006.919857 hartree
zpe.sumelectthermalfe: -1006.962947 hartree
dipole: 0.8600 2.0061 -0.0381
dipole: 2.1830
quadrupole: -45.0478 -60.0500 -58.0097
quadrupole: 1.3824 0.6511 -0.2797
quadrupole: 9.3214 -5.6809 -3.6405 1.3824 0.6511 -0.2797
hfenergy: -1007.0339378 hartree
pointgroup: C01 [X(C4H7N1S2)]
dipole: 0.3640715 0.7773515 -0.0289318 debye
dipolederiv: -0.5387112 0.2512442 -0.0038599 0.1342861 -0.3214843 -0.0011638 0.0133532 -0.0093246 -0.0537282 -0.5762313 -0.0088103 0.0254656 -0.0256837 -0.0475852 -0.0076839 0.043996 -0.0159905 -0.0435351 -0.7601168 0.0251289 0.0068304 -0.2005877 -1.0484164 0.0303018 -0.0015726 -0.0551673 -0.2519762 0.1162626 0.0990371 0.0237615 0.2540843 -0.0575539 0.0772323 0.0622664 0.0655278 0.154093 0.3054929 0.0468083 -0.0255977 -0.0158287 0.2847683 -0.0145201 -0.0152302 -0.050396 0.2716843 1.3932692 -0.1586434 -0.0560463 0.0207018 0.9273739 -0.0147112 -0.0756112 0.0540591 -0.0829737 0.0955952 -0.0961673 0.0108848 -0.1262825 0.0848659 -0.0053451 -0.0018033 -0.0030053 0.0526932 -0.0898327 0.0035888 0.0666549 -0.022014 0.0957119 -0.0150109 0.0853764 -0.0188796 0.0463802 0.0178637 -0.0153967 -0.0590296 -0.0709704 0.0388676 -0.0282259 -0.1119153 -0.004044 -0.1030857 0.020599 -0.0490394 -0.0171387 -0.0777244 -0.0625875 -0.0776376 -0.0635333 -0.0960723 0.0374532 -0.0289913 -0.0656028 0.0259185 0.0070422 0.0566167 0.0459898 0.0771523 0.1225279 -0.1202104 0.078844 -0.0004942 0.043923 0.0782388 -0.0045202 0.0870187 0.018385 0.0629595 -0.0360464 0.087376 -0.0140379 -0.0496325 0.0647939 -0.0218475 -0.0837367 -0.0361815 -0.0584358 -0.0000087 -0.1214192 -0.0176153 0.007866 -0.0200555 0.0757906 0.0074927 0.0053181 0.0062411 0.1292605 unknown
polarizability: 115.3241399|0.2936997|85.79901|-0.2224544|0.2201082|45.0806324 unknown
InChI: InChI=1S/C4H7NS2/c1-6-4-5-2-3-7-4/h2-3H2,1H3
charge 0 multiplicity 1
14 atoms
S  1.126231 -1.549095 -0.054427
S  -1.924961 -0.943986 0.151852
N  0.073012 0.970484 0.069787
C  2.330547 -0.106136 0.258697
C  1.534871 1.18733 -0.101466
C  -0.248009 -0.284337 0.067428
C  -2.891003 0.671913 0.034297
H  3.21451 -0.248109 -0.380677
H  2.616824 -0.138024 1.321264
H  1.854935 2.028524 0.53778
H  1.713713 1.474666 -1.156332
H  -2.658344 1.167593 -0.918312
H  -2.613192 1.321854 0.875084
H  -3.952635 0.385824 0.084824
