program: Gaussian 09
title: 000007989
version: EM64L-G09RevD.01
frameworkgroup: C1[X(C6H10O)]
method: RPBEPBE
basis: SDD
operation: Freq
keyword: #pfreq=noraman
keyword: PBEPBE/SDD
title: #p freq=noraman PBEPBE/SDD
converged: YES YES NO NO
title: Mulliken charges:
elementType: O C C C C C C H H H H H H H H H H
charge: -0.212624 -0.489385 -0.447434 0.233323 -0.031845 -0.765350 -0.593012 0.243647 0.234428 0.235452 0.218695 0.209153 0.256727 0.231295 0.241410 0.215544 0.219979
chargesum: 0.00000
title: Mulliken charges with hydrogens summed into heavy atoms:
elementType: O C C C C C C
charge: -0.212624 -0.011310 0.006713 0.233323 0.177307 -0.035919 -0.157490
polarizability: 8.88038146e+01 2.48946736e+00 5.89448761e+01 -5.83533370e+00 1.36719229e+00 5.38892059e+01
1716.lowfreq: -16.8964 -2.8663 0.0005 0.0008 0.0009 6.8002 45.8041 62.4142 89.8598
frequency: 45.7134 62.3936 89.8169 108.4985 164.7501 300.1221 348.0321 426.6131 469.3990 573.3757 627.4715 743.9905 817.4996 902.9895 919.6575 942.9214 968.0953 996.8194 1015.5529 1061.4210 1122.3104 1164.8338 1199.0168 1256.5536 1280.5276 1292.8647 1342.3319 1367.6461 1427.1487 1429.5496 1443.2855 1456.6421 1462.4298 1636.7450 1659.6928 2956.7276 2980.8692 2989.9650 3013.7941 3052.1132 3067.4814 3071.7918 3091.0203 3119.8021 3195.3166
redmass: 2.4711 2.7199 1.4292 1.5221 2.8133 3.3852 2.4688 2.0411 2.0622 3.9310 1.5046 1.2965 3.3120 1.3681 1.8699 1.3503 1.7545 1.1549 1.5174 3.1271 1.7820 1.9289 1.6868 1.3118 1.2606 1.2502 1.6997 1.2391 1.1746 1.0954 1.0651 1.0579 1.0974 7.8015 4.7592 1.0634 1.0380 1.0619 1.0928 1.0962 1.0949 1.0840 1.0729 1.1006 1.1145
irintensity: 2.0817 0.8917 0.2341 0.8375 4.8884 3.5555 0.6967 2.4302 3.2724 5.7583 19.7907 2.9085 2.1010 2.8906 4.3115 86.7378 2.0376 7.1236 14.1191 1.1839 1.2121 41.6121 19.4109 43.6578 12.9272 4.7296 31.4816 58.5202 4.8083 23.9911 19.7738 20.5321 16.7048 112.9902 21.2454 15.5311 4.5368 12.8007 10.7071 6.2028 10.7351 50.5573 5.7251 14.4075 30.5339
temp: 298.150 k
press: 1.00000 atm
elementType: 8 6 6 6 6 6 6 1 1 1 1 1 1 1 1 1 1
symmnumber: 1
zpe: 374823.5 jmol-1
zpe.correction: 0.142763 hartree
zpe.thermalcorrener: 0.151587 hartree
zpe.thermalcorrenthalpy: 0.152532 hartree
zpe.thermalcorrgfe: 0.108224 hartree
zpe.sumelectzpe: -309.275301 hartree
zpe.sumelectthermal: -309.266477 hartree
zpe.sumelectthermalent: -309.265532 hartree
zpe.sumelectthermalfe: -309.309840 hartree
dipole: -0.0455 -2.9952 -0.0814
dipole: 2.9967
quadrupole: -43.5158 -47.8917 -40.7959
quadrupole: -5.2704 0.2119 0.8577
quadrupole: 0.5520 -3.8239 3.2720 -5.2704 0.2119 0.8577
hfenergy: -309.418064 hartree
pointgroup: C01[X(C6H10O1)]
dipole: 0.0335967 -1.1741523 -0.1012573 debye
dipolederiv: -0.6634801 0.0580913 -0.0053143 0.0849599 -0.8633717 -0.0854481 -0.029244 -0.0703356 -0.304086 -0.4384852 0.1354651 -0.0381597 0.3099418 -0.0933383 -0.0054617 -0.122375 0.0349343 0.1656096 -0.1068142 0.0268567 -0.002404 0.0841043 0.0747144 0.0371032 0.0560915 0.0034461 0.1081798 1.1751662 0.0021743 0.1179197 -0.0914313 0.9853504 0.1483434 0.155597 0.1340905 0.1132183 0.3029336 -0.1263896 -0.0665454 -0.2618201 -0.1085862 -0.1127752 -0.0109149 -0.133473 0.1021868 -0.389713 -0.233665 -0.0821641 -0.2181027 -0.1944281 -0.0921358 -0.1423129 -0.1339961 -0.0106412 -0.2457047 -0.1294009 0.033987 -0.110974 -0.272781 -0.2014539 0.0820396 -0.2038198 -0.0568065 0.0517112 -0.0007272 -0.0130514 -0.068434 -0.0128282 -0.0958379 0.0000914 -0.125856 -0.0121626 0.0736354 0.0047086 0.0051551 -0.0286836 0.0316228 0.0797572 0.0214329 0.1123158 -0.0503398 0.0710584 0.0436071 0.0407755 0.0029829 0.0003441 -0.0913314 -0.0080024 -0.0956966 0.0061043 0.0310264 -0.0147264 0.015276 -0.0148454 0.032243 0.0747017 -0.019602 0.1046056 -0.096229 0.0462725 0.0230793 0.0173613 0.0678746 0.071604 0.120092 -0.0256271 0.1237344 -0.0928859 -0.0906324 0.0337277 0.0415173 0.075146 0.0576508 -0.031698 0.0570956 -0.0110228 0.1120034 0.0837231 0.0424363 -0.053301 0.0216086 -0.0521151 0.0894328 -0.0005501 0.119823 0.0618499 0.0978157 -0.018407 0.0349047 -0.0127331 0.1040714 -0.0254331 0.0013998 -0.0422528 -0.0771917 -0.0877432 0.1015944 -0.021476 0.1269683 0.1294108 0.0616677 -0.021329 0.0667454 0.0874942 0.0892304 0.0515755 -0.0244807 0.0334379 0.1104368 0.1304771 0.0062094 0.1167576 -0.0563035 unknown
polarizability: 88.579881|-1.3857612|59.1379019|-6.8047459|-0.8314923|53.9201136 unknown
InChI: InChI=1S/C6H10O/c1-3-4-5-6(2)7/h3H,1,4-5H2,2H3
charge 0 multiplicity 1
17 atoms
O  -1.836262 1.293583 0.236695
C  -0.244895 -0.562058 0.165238
C  0.901053 0.474682 0.115378
C  -1.644852 0.057099 0.092909
C  2.249443 -0.15499 0.389195
C  -2.798874 -0.905695 -0.169743
C  3.315113 -0.127671 -0.450404
H  -0.136863 -1.314161 -0.641816
H  -0.194675 -1.142885 1.112518
H  0.683112 1.262098 0.863769
H  0.90415 0.977756 -0.868931
H  2.350314 -0.667745 1.36017
H  -3.756965 -0.443573 0.115562
H  -2.661574 -1.861304 0.367636
H  -2.835426 -1.142699 -1.251396
H  4.26898 -0.597932 -0.186062
H  3.263722 0.372194 -1.425918
