program: Gaussian 09
title: 000088321
version: EM64L-G09RevD.01
frameworkgroup: C1[X(C8H15NS2)]
method: RPBEPBE
basis: SDD
operation: Freq
keyword: #p
keyword: freq=noraman
keyword: PBEPBE/SDD
title: #p freq=noraman PBEPBE/SDD
converged: YES YES NO NO
title: Mulliken charges:
elementType: S S N C C C C C C C C H H H H H H H H H H H H H H H
charge: 0.059277 0.062271 -0.094860 0.068580 -0.350548 -0.357046 -0.402886 -0.402833 -0.400368 -0.771887 -0.764013 0.233853 0.175631 0.210085 0.218096 0.175596 0.196908 0.206742 0.206253 0.196982 0.218458 0.191760 0.277064 0.286375 0.282237 0.278273
chargesum: 0.00000
title: Mulliken charges with hydrogens summed into heavy atoms:
elementType: S S N C C C C C C C C
charge: 0.059277 0.062271 -0.094860 0.302433 0.035169 0.036646 0.000764 0.000402 0.009849 -0.208448 -0.203503
polarizability: 1.58206746e+02 2.77472771e-01 1.27447704e+02 4.27072115e+00 -3.63930424e-01 8.32827748e+01
1716.lowfreq: -38.5322 -0.0007 0.0025 0.0025 6.1402 10.4202 19.5563 45.7628 66.4437
frequency: -38.0301 45.6470 66.4430 147.8084 160.5141 220.4942 252.6231 292.8949 332.2255 373.5811 379.9333 407.4471 441.5254 453.3428 466.9373 570.8604 697.6182 711.5162 789.6186 803.3106 841.2466 851.7715 858.1885 871.3747 917.1567 956.8142 987.0113 994.7908 1047.0302 1057.9132 1075.0473 1095.5468 1103.2750 1120.8016 1146.4628 1155.0632 1211.2990 1213.7552 1228.1419 1238.6322 1260.5788 1275.3926 1284.2687 1316.2013 1318.7208 1334.6090 1345.3830 1356.0556 1359.1193 1385.7626 1432.6726 1448.7554 1451.9575 1461.4494 1464.0645 1467.1968 1478.2704 2829.6787 2839.0339 2871.2357 2971.4623 2987.1447 2987.5997 3028.1079 3032.8861 3037.3152 3046.0747 3054.7302 3056.3361 3061.4003 3109.0950 3115.2516
redmass: 2.4764 5.4546 3.6791 3.4459 3.6141 1.8217 5.2170 2.2366 8.6437 1.8460 3.4286 19.6796 2.9321 2.1015 2.7826 2.1910 5.0502 6.0127 3.9734 1.4930 1.3399 2.1241 1.6985 2.4786 2.4291 1.3062 2.0879 1.8702 2.2617 2.4290 1.1795 1.4990 2.6211 2.5948 2.3220 1.2946 1.4073 1.4038 1.1701 1.5354 1.2645 1.1501 1.1920 1.3595 1.3324 1.3102 1.4316 1.4809 1.4008 1.3658 1.0811 1.0898 1.0882 1.0874 1.0800 1.0947 1.0947 1.0717 1.0710 1.0808 1.0625 1.0608 1.0614 1.0558 1.0572 1.0959 1.1020 1.0989 1.0866 1.0919 1.1085 1.1081
irintensity: 0.1714 0.3035 0.6391 2.1435 1.8100 0.5960 0.3405 4.2869 0.0447 2.4546 0.9719 0.0532 0.2367 1.7267 0.8037 0.1479 5.8030 0.0173 15.8686 0.1449 2.4579 3.6468 0.7097 17.3536 1.9614 3.1491 14.8217 14.0748 7.7517 2.5124 10.3956 2.9578 35.1218 5.4208 17.6988 3.0865 25.2157 22.8981 1.7883 0.2240 2.4819 16.1705 1.8094 16.0439 2.3302 0.9733 0.3350 2.3036 0.7151 0.3539 3.1802 4.8059 7.5160 15.6208 0.2627 14.5624 6.1702 37.4074 109.1108 74.7478 37.0684 37.2246 32.8534 5.5041 23.5306 55.9823 39.2466 38.1791 38.8112 65.9053 0.9844 14.2263
temp: 298.150 k
press: 1.00000 atm
elementType: 16 16 7 6 6 6 6 6 6 6 6 1 1 1 1 1 1 1 1 1 1 1 1 1 1 1
symmnumber: 1
zpe: 580508.7 jmol-1
zpe.correction: 0.221104 hartree
zpe.thermalcorrener: 0.231816 hartree
zpe.thermalcorrenthalpy: 0.232760 hartree
zpe.thermalcorrgfe: 0.183839 hartree
zpe.sumelectzpe: -1163.813721 hartree
zpe.sumelectthermal: -1163.803009 hartree
zpe.sumelectthermalent: -1163.802065 hartree
zpe.sumelectthermalfe: -1163.850986 hartree
dipole: 4.1595 0.0357 -0.2916
dipole: 4.1698
quadrupole: -92.8385 -79.0360 -85.1206
quadrupole: 0.0446 -1.2739 -0.0138
quadrupole: -7.1735 6.6290 0.5445 0.0446 -1.2739 -0.0138
hfenergy: -1164.0348251 hartree
pointgroup: C01 [X(C8H15N1S2)]
dipole: -1.6372062 -0.016695 -0.1032366 debye
dipolederiv: -0.1475316 -0.0344785 -0.0028037 -0.0482084 -0.0409333 0.0347865 -0.0202498 0.0724965 -0.1191656 -0.1579337 0.0232883 -0.0046183 0.0431462 -0.0361161 -0.0340104 -0.0209672 -0.0658547 -0.1192217 -0.8518731 -0.0080856 -0.0347273 -0.0138527 -0.4605652 0.0011835 -0.09411 0.0066809 -0.4922494 0.5664919 0.0072637 -0.0379663 0.008357 0.0602536 -0.0018895 0.1826629 -0.0035708 0.3189048 0.1728472 -0.1628378 0.0729157 -0.2768162 0.3048562 -0.0715561 0.1311314 -0.0985387 0.4073837 0.1724352 0.1678937 0.061582 0.2851337 0.3192813 0.0763567 0.1059987 0.1033187 0.3956856 0.0162702 -0.0017603 0.0060677 0.0076301 0.0809586 -0.0262143 -0.0260504 0.0099379 0.1304119 0.0165599 0.0023448 0.0061452 -0.0054913 0.0832906 0.0293097 -0.0251558 -0.0080996 0.1304598 0.065871 -0.0003056 -0.0135963 0.0009531 0.0089109 0.0030792 0.0403519 0.0036117 0.146768 0.1074584 0.0675357 -0.0787884 0.0912793 -0.0750561 0.0066095 -0.1074761 -0.0768274 0.1318402 0.1020655 -0.0496232 -0.0857536 -0.0714785 -0.084517 -0.0197696 -0.1158245 0.0594646 0.1324599 -0.0494021 -0.0014837 -0.0067704 -0.0073125 0.0033178 0.0060892 0.0879498 0.0056917 -0.2009502 -0.0137781 0.0488506 0.0164003 0.0625747 0.003168 -0.0381695 -0.0578922 0.11488 -0.266005 0.0070565 -0.1212091 -0.032248 -0.1080922 -0.0965618 -0.026996 -0.0577595 -0.0349352 0.0385012 0.0074742 0.1151326 -0.0377697 0.1040376 -0.090722 0.0342458 -0.0674089 0.0384277 0.0341193 -0.0128392 -0.0484401 0.0187331 -0.0687445 -0.0056087 0.0217719 -0.0513294 -0.1295125 -0.2616427 -0.0302484 0.0915868 -0.0240176 0.1062058 -0.1469627 0.0556941 -0.0485663 0.0907019 0.0562768 0.0462367 -0.0290342 -0.0150566 -0.0408473 0.0689631 0.0079593 0.0293432 -0.0558056 -0.1668359 0.0447616 0.0279599 -0.0162625 0.0423218 0.0712316 -0.0200874 0.0274746 0.0444046 -0.1687227 -0.0283302 -0.0912911 -0.0188331 -0.1073728 -0.1549556 -0.0450216 -0.0428264 -0.0807348 0.0629758 -0.223918 0.0007277 0.0724629 0.002166 0.0552671 0.0003232 0.1069499 0.0002023 0.0526904 0.0899672 0.0003602 0.0065342 -0.00174 0.0193532 -0.0050857 -0.0732868 -0.0052111 -0.1918763 -0.0088821 -0.0340354 0.080003 0.0120143 0.068362 -0.012565 0.0447389 0.0522565 -0.0870565 0.0529867 -0.0963035 -0.0104072 -0.0696383 -0.0127223 -0.0463268 0.0036233 -0.0287907 0.0583435 0.0627814 0.1011864 -0.0012972 0.0706342 -0.017201 0.0409179 0.0124235 0.0248087 0.0676218 -0.006527 0.0247577 0.0800719 -0.0168592 0.0747076 0.0293655 0.0362554 -0.0390024 -0.0907167 unknown
polarizability: 158.1416508|0.3515707|127.4460943|-4.7982756|0.4953419|83.3494794 unknown
InChI: InChI=1S/C8H15NS2/c1-2-4-9(5-3-1)8-6-10-11-7-8/h8H,1-7H2
charge 0 multiplicity 1
26 atoms
S  3.564291 -1.152344 -0.147521
S  3.558461 1.178633 -0.105528
N  -0.446571 0.009634 0.171147
C  0.988755 0.014038 -0.257465
C  -1.176286 1.219671 -0.315856
C  -1.16756 -1.228203 -0.25431
C  -2.628254 1.262047 0.20153
C  -2.620427 -1.251367 0.262852
C  -3.401698 -0.00782 -0.209745
C  1.722601 -1.253128 0.251761
C  1.727813 1.240023 0.340057
H  1.089266 0.051793 -1.372671
H  -1.182767 1.250492 -1.437864
H  -0.65012 2.122166 0.036706
H  -0.638799 -2.107676 0.148663
H  -1.172094 -1.318964 -1.37315
H  -3.122369 2.170905 -0.192324
H  -2.610202 1.34275 1.305615
H  -2.602671 -1.277218 1.369641
H  -3.109143 -2.181486 -0.085522
H  -4.4214 -0.000851 0.218615
H  -3.512888 -0.034864 -1.313524
H  1.584736 -1.355257 1.340613
H  1.382722 -2.164237 -0.265921
H  1.375059 2.190082 -0.092095
H  1.608242 1.25118 1.435497
