program: Gaussian 09
title: 000088327
version: EM64L-G09RevD.01
frameworkgroup: C1[X(C10H9NO2S)]
method: RPBEPBE
basis: SDD
operation: Freq
keyword: #p
keyword: freq=noraman
keyword: PBEPBE/SDD
title: #p freq=noraman PBEPBE/SDD
converged: NO YES NO NO
title: Mulliken charges:
elementType: S O O N C C C C C C C C C C H H H H H H H H H
charge: 0.174987 -0.398268 -0.217179 -0.029073 -0.186049 -0.734883 -0.351292 0.490615 0.187666 -0.363279 -0.350850 -0.221292 -0.230395 -0.228740 0.277589 0.314924 0.270500 0.276426 0.240035 0.232149 0.231507 0.232995 0.381907
chargesum: 0.00000
title: Mulliken charges with hydrogens summed into heavy atoms:
elementType: S O O N C C C C C C C C C C
charge: 0.174987 -0.016361 -0.217179 -0.029073 0.091540 -0.149459 -0.351292 0.490615 0.187666 -0.086853 -0.110815 0.010857 0.001112 0.004255
polarizability: 2.03727530e+02 2.79347727e+00 1.40721308e+02 -7.08332380e+00 7.18306796e+00 7.21437372e+01
1716.lowfreq: -13.8814 -2.2535 0.0020 0.0021 0.0027 10.7339 29.1773 39.3813 53.7172
frequency: 29.0486 39.3573 53.6990 80.9087 117.7219 171.9381 220.1646 280.4721 300.8684 344.8215 373.2301 399.6153 442.3363 544.0987 574.7495 598.7893 608.5723 619.7126 630.1378 660.3271 693.7114 700.3926 735.3049 780.7667 819.1281 855.5823 894.1672 939.3272 945.5687 972.3393 987.3093 989.5829 992.5864 1005.5657 1028.6841 1060.8735 1087.5328 1137.7131 1174.4448 1190.7035 1220.0984 1249.5826 1258.1886 1282.9487 1320.1021 1343.8564 1385.3725 1437.1289 1452.9285 1479.9087 1580.1170 1598.1001 1612.4346 1667.6093 3013.6260 3049.5991 3128.3915 3135.2030 3135.3037 3148.0904 3162.2265 3172.4376 3510.5691
redmass: 4.2088 9.8416 7.3382 4.6526 5.2915 4.9700 4.0484 6.8582 7.4599 8.1755 6.4449 2.8022 4.2878 3.9055 3.8145 3.8122 5.6454 2.3111 4.8804 3.3627 1.8069 5.5291 6.0087 1.8174 3.4720 1.2522 6.7860 1.4792 1.6785 4.6207 1.4245 5.3033 4.6163 1.3340 2.0855 2.0207 1.5771 1.3149 1.0559 1.1116 1.2724 2.9506 1.4772 1.2126 1.3194 2.0709 8.4689 2.2924 1.0892 2.3123 6.8802 8.7861 6.0797 9.0128 1.0843 1.0571 1.0855 1.1051 1.0926 1.0929 1.0966 1.1001 1.0640
irintensity: 0.2084 1.1981 0.8339 1.5358 2.1809 1.2466 4.4097 1.2938 4.8352 3.8315 5.4114 0.0021 1.2181 29.7298 62.6016 20.5527 1.6942 77.7567 4.1432 16.8962 49.1582 19.5662 68.6119 53.8903 1.9978 0.1899 100.3044 0.6998 16.7485 16.6632 0.7581 5.8331 73.6548 0.6150 10.6021 238.6861 11.5704 10.4485 0.4402 8.7917 12.6465 55.0284 24.4319 21.3337 4.9843 43.1413 0.8913 17.0990 11.5364 16.7231 54.7074 61.3901 9.7834 203.9095 12.1171 10.7193 1.9869 8.8680 2.3857 20.9499 17.5582 18.0055 28.1839
temp: 298.150 k
press: 1.00000 atm
elementType: 16 8 8 7 6 6 6 6 6 6 6 6 6 6 1 1 1 1 1 1 1 1 1
symmnumber: 1
zpe: 445164.4 jmol-1
zpe.correction: 0.169554 hartree
zpe.thermalcorrener: 0.181959 hartree
zpe.thermalcorrenthalpy: 0.182903 hartree
zpe.thermalcorrgfe: 0.128499 hartree
zpe.sumelectzpe: -988.721785 hartree
zpe.sumelectthermal: -988.709379 hartree
zpe.sumelectthermalent: -988.708435 hartree
zpe.sumelectthermalfe: -988.762840 hartree
dipole: -0.2912 -0.4164 -1.0880
dipole: 1.2008
quadrupole: -68.9516 -81.5989 -96.2621
quadrupole: -0.8097 -6.0938 -0.6114
quadrupole: 13.3193 0.6720 -13.9912 -0.8097 -6.0938 -0.6114
hfenergy: -988.8913387 hartree
pointgroup: C01 [X(C10H9N1O2S1)]
dipole: -0.0876963 -0.1414322 -0.442167 debye
dipolederiv: -0.2536683 -0.1843884 -0.0261782 -0.1739917 -0.6280561 -0.0539818 0.0144245 -0.0519153 -0.0761784 -0.6957414 0.2946937 0.3107381 0.4015534 -0.7891848 -0.4070495 0.2673626 -0.3100313 -0.5209051 -0.5676877 0.1100086 -0.1921196 0.2898508 -0.4849988 0.0050752 -0.1753718 -0.1635174 -0.8821779 -0.7818579 0.1484445 0.0240529 0.28499 -0.8873835 -0.0383085 -0.0767556 -0.0304272 -0.2870491 0.1006003 0.0808006 -0.1097114 0.0847695 0.2131994 0.0059311 -0.0749676 0.0480334 0.1747516 0.1600521 0.1113632 0.022122 -0.0504301 -0.0990474 -0.0849196 0.0029205 -0.0448506 0.0753273 1.0237937 0.2080188 -0.0345248 0.3603128 1.2769941 0.1164856 -0.0489693 0.1371771 0.0261538 -0.2701088 -0.0691042 0.0040347 -0.2230757 -0.1808909 -0.0052702 0.0089311 -0.027957 0.0260832 1.0335602 -0.611506 0.0719392 -0.8391392 0.9075457 0.346526 0.1343173 0.3190593 1.202976 -0.0085704 -0.1001988 -0.0310466 0.0994684 0.0122278 0.0165424 0.0077893 0.0266969 -0.108586 0.0466744 0.1062512 0.0054628 -0.0123632 0.0099064 0.0321773 -0.0074434 0.0236947 -0.1280877 -0.1723617 0.0678505 0.0149088 0.0887363 0.1351658 0.0483938 0.0159897 0.0466801 -0.1427266 -0.014016 -0.1514851 -0.0416996 -0.2453025 -0.0387214 0.0351866 -0.0578916 0.0344448 -0.1397629 0.0752553 0.0311496 -0.0159051 0.0431126 0.002582 0.0242246 -0.0090239 0.0258754 -0.1398709 -0.0452092 0.0112021 0.0402564 -0.0832066 0.065126 -0.0116453 0.071803 -0.0147617 -0.0534459 0.005731 -0.0334316 -0.0473782 0.0219022 0.1294674 0.0231344 -0.0348042 -0.0335437 -0.0139186 -0.0295322 -0.0775417 0.0438995 -0.0650583 0.0383785 0.0427412 0.0559416 0.0759941 0.0580369 0.0654679 0.0936786 0.0281702 0.0643256 0.0664698 -0.0209056 0.0238545 -0.0214262 0.1458336 0.1143632 -0.0702634 -0.0027669 -0.0712657 -0.044507 -0.0352477 -0.0167781 -0.03129 0.1452599 0.0546229 -0.0504771 -0.0019099 -0.0736168 -0.1010396 -0.0438216 -0.0048623 -0.0436698 0.1482779 -0.03969 0.0817868 0.0296949 0.1093366 0.0012428 -0.0381817 0.0353243 -0.0372908 0.1487183 -0.1155917 -0.0636696 0.0089276 -0.0673049 0.0775509 -0.0105838 0.0093475 -0.009844 0.157285 0.3139144 0.0668178 -0.1009668 0.0563964 0.3179729 0.0534972 -0.141138 0.0828691 0.1840057 unknown
polarizability: 203.9328198|4.1232502|139.8475896|-0.1600422|11.1725194|72.8121661 unknown
InChI: InChI=1S/C10H9NO2S/c12-10(13)8-6-14-9(11-8)7-4-2-1-3-5-7/h1-5,8,12H,6H2
charge 0 multiplicity 1
23 atoms
S  0.457715 2.356168 0.05162
O  3.929433 -1.437547 -0.346769
O  3.589071 -0.337259 1.67094
N  0.999988 -0.291654 -0.280336
C  2.332005 0.36648 -0.35502
C  2.268185 1.828607 0.189955
C  0.010273 0.540922 -0.114201
C  -1.410331 0.138631 -0.071191
C  3.329017 -0.471083 0.457857
C  -1.751343 -1.224587 -0.29834
C  -2.441993 1.079136 0.188025
C  -3.098598 -1.632747 -0.264412
C  -3.790832 0.666033 0.218293
C  -4.12353 -0.689555 -0.007109
H  2.653536 0.341503 -1.41364
H  2.560552 1.865424 1.250772
H  2.879268 2.520823 -0.406698
H  -0.945488 -1.937612 -0.497585
H  -2.191345 2.129673 0.375634
H  -3.353381 -2.683703 -0.439277
H  -4.579847 1.398343 0.420008
H  -5.171163 -1.009429 0.018037
H  4.529006 -2.009566 0.205938
