program: Gaussian 09
title: 000088272
version: EM64L-G09RevD.01
frameworkgroup: C1[X(C9H9BrO)]
method: RPBEPBE
basis: SDD
operation: Freq
keyword: #p
keyword: freq=noraman
keyword: PBEPBE/SDD
title: #p freq=noraman PBEPBE/SDD
converged: NO YES NO NO
title: Mulliken charges:
elementType: Br O C C C C C C C C C H H H H H H H H H
charge: 0.015659 -0.216754 0.290053 -0.481506 0.142357 -0.289115 -0.343678 -0.682521 -0.204465 -0.228296 -0.185601 0.233103 0.233056 0.297353 0.249937 0.232176 0.211179 0.232071 0.238019 0.256972
chargesum: 0.00000
title: Mulliken charges with hydrogens summed into heavy atoms:
elementType: Br O C C C C C C C C C
charge: 0.015659 -0.216754 0.290053 -0.015347 0.142357 0.008238 -0.093740 -0.007095 -0.204465 0.009723 0.071371
polarizability: 1.71535866e+02 3.40855177e+00 1.21195665e+02 -8.46851437e-03 4.05830974e-03 5.23475910e+01
1716.lowfreq: -1.1383 -0.0006 -0.0005 0.0002 5.1501 8.6610 37.8810 79.9413 107.7470
frequency: 37.8368 79.9290 107.7469 137.5275 168.5090 197.2782 206.1255 278.9877 304.0562 357.8680 411.7394 466.8730 475.9950 586.6988 628.1737 662.2132 687.8701 755.3288 780.6865 818.7314 917.3242 944.8664 962.1448 983.3018 987.3484 1023.0052 1064.5482 1070.2126 1090.8520 1096.5975 1184.0402 1207.9614 1244.6430 1284.2801 1330.2856 1378.3027 1399.4904 1411.1803 1434.9378 1456.3130 1468.8511 1477.2643 1559.8035 1591.7323 1604.3582 2967.7770 2999.2128 3014.2579 3095.4208 3103.6345 3141.3063 3161.7945 3166.1018 3175.2346
redmass: 5.5025 1.6654 6.2967 4.0383 2.6328 1.5289 4.8573 6.1074 4.4071 7.0887 3.0552 3.5156 5.7840 2.7336 5.7055 5.7974 2.2016 4.6473 1.3673 1.4707 1.3711 1.3929 4.1311 5.2551 1.3545 1.6947 2.0884 1.6626 2.4364 1.7162 1.0905 2.5294 1.1843 1.3264 1.9372 9.4874 1.2113 2.7920 1.1358 2.1499 1.0388 1.0519 6.4495 7.0698 7.8067 1.0602 1.0364 1.0979 1.1003 1.0999 1.0869 1.0926 1.0922 1.0988
irintensity: 2.4553 0.8916 0.4532 0.0341 0.3320 0.5128 0.2844 9.0685 5.1105 2.9862 1.6068 5.2973 3.3948 0.8597 0.4392 42.8206 25.3631 34.1466 67.6673 0.0339 0.7459 9.3158 9.3431 6.2163 0.0202 11.0622 19.2345 1.9734 1.4987 2.3005 7.1788 239.6537 0.3023 2.2340 64.7206 0.5025 25.0568 68.9305 12.6314 12.8645 12.2613 15.4135 74.5715 29.6082 42.8376 33.0123 29.2490 9.7480 26.3729 29.4521 5.1238 8.4291 2.9679 10.9588
temp: 298.150 k
press: 1.00000 atm
elementType: 35 8 6 6 6 6 6 6 6 6 6 1 1 1 1 1 1 1 1 1
symmnumber: 1
zpe: 401637.6 jmol-1
zpe.correction: 0.152976 hartree
zpe.thermalcorrener: 0.163854 hartree
zpe.thermalcorrenthalpy: 0.164798 hartree
zpe.thermalcorrgfe: 0.114511 hartree
zpe.sumelectzpe: -436.241888 hartree
zpe.sumelectthermal: -436.231009 hartree
zpe.sumelectthermalent: -436.230065 hartree
zpe.sumelectthermalfe: -436.280353 hartree
dipole: 1.3963 4.1191 0.0029
dipole: 4.3493
quadrupole: -69.3742 -71.8461 -76.3881
quadrupole: 5.5292 0.0062 -0.0097
quadrupole: 3.1620 0.6900 -3.8520 5.5292 0.0062 -0.0097
hfenergy: -436.3948636 hartree
pointgroup: C01 [X(C9H9Br1O1)]
dipole: -0.2037228 1.6989733 0.0018929 debye
dipolederiv: -0.5094874 0.3146825 0.0003854 0.3834034 -0.3322797 -0.0003984 0.0005671 -0.000458 -0.0351139 -0.7933463 -0.0759588 -0.0004947 -0.3379322 -0.7875789 -0.0007006 -0.0006758 -0.0003504 -0.2926657 -0.7180583 -0.1246335 -0.0006032 -0.2123599 -0.0003284 0.0000649 -0.0010588 0.0000164 -0.008809 -0.2579232 0.1325561 -0.0000298 0.2941366 -0.1578294 -0.0003066 0.0009644 -0.000777 0.148386 1.6641334 0.0961032 0.0011009 0.2619186 0.8056893 0.0006779 0.0013509 0.0007793 0.1106094 -0.3193196 0.2584216 0.0003586 0.0728037 -0.1238852 -0.0000844 0.0002006 -0.0000631 -0.048207 0.0395824 -0.059229 -0.0000051 0.0989354 -0.04559 0.0002396 -0.0000387 0.0000193 -0.1381007 -0.0296182 -0.0492387 -0.0002028 -0.0244162 0.0638699 0.0000076 -0.0003411 0.0000848 0.0607809 0.8785096 -0.7255504 -0.000948 -0.7809655 0.497797 0.0008735 -0.0010915 0.0009024 -0.1249318 -0.096497 -0.0066588 0.0000008 0.11881 0.1273258 0.000586 0.0002776 0.0005775 -0.1418742 -0.1353145 0.2177349 0.0004004 0.1540337 -0.1667635 -0.0001011 0.0002834 -0.000061 -0.0845978 0.0180585 -0.0358117 -0.0603787 -0.059574 0.0152046 -0.0919018 -0.0664245 -0.1050727 -0.0257241 0.0177744 -0.0364832 0.0603243 -0.0602612 0.0142009 0.0920772 0.0660198 0.105328 -0.0245342 0.1716664 -0.0369658 -0.0000843 0.0257777 0.0383136 -0.0002443 -0.0000486 -0.000217 0.1540297 0.0043276 0.1053271 0.0001427 0.112298 0.0324716 -0.0001465 0.0001624 -0.0001261 0.1454659 0.0839518 -0.0031154 -0.00342 -0.0664137 0.0268971 0.1078778 0.032899 0.0978585 -0.059464 -0.1161052 0.1003801 -0.0000854 0.162516 -0.0303656 -0.0000808 0.0000143 -0.0001694 0.1038405 0.0838007 -0.0028505 0.0038163 -0.0659103 0.0277185 -0.1077582 -0.0327694 -0.0975772 -0.0605889 0.0502936 -0.0213496 -0.0000928 -0.0384663 -0.1020341 -0.0005373 -0.00011 -0.0005401 0.1611255 -0.0364287 -0.04736 -0.0001848 -0.0383339 0.0971664 -0.0001445 -0.0001813 -0.0001543 0.1603734 unknown
polarizability: 168.0251171|-13.2674648|124.7061703|0.0381222|0.1239179|52.3478351 unknown
InChI: InChI=1S/C9H9BrO/c1-2-9(11)7-4-3-5-8(10)6-7/h3-6H,2H2,1H3
charge 0 multiplicity 1
20 atoms
Br 3.643011 -1.685644 -0.002315
O  -1.831087 -1.672545 -0.003042
C  -0.212153 0.111492 -0.000654
C  -2.787019 0.571331 -0.002102
C  -1.623969 -0.424928 -0.00249
C  0.850593 -0.832957 -0.001934
C  0.086579 1.500237 0.002181
C  -4.166349 -0.109059 -0.005668
C  2.17767 -0.377365 -0.000392
C  1.42859 1.935837 0.003729
C  2.489263 1.000425 0.002452
H  -2.680623 1.231556 0.883459
H  -2.678036 1.235863 -0.883983
H  0.5982 -1.897763 -0.004074
H  -0.719471 2.240366 0.003154
H  -4.288619 -0.755662 0.879772
H  -4.971345 0.647384 -0.005232
H  -4.286036 -0.751776 -0.894308
H  1.661027 3.005999 0.005949
H  3.530274 1.336409 0.003597
