program: Gaussian 09
title: 000088218
version: EM64L-G09RevD.01
frameworkgroup: C1[X(C13H19NO4)]
method: RPBEPBE
basis: SDD
operation: Freq
keyword: #p
keyword: freq=noraman
keyword: PBEPBE/SDD
title: #p freq=noraman PBEPBE/SDD
converged: YES YES NO NO
title: Mulliken charges:
elementType: O O O O N C C C C C C C C C C C C C H H H H H H H H H H H H H H H H H H H
charge: -0.258917 -0.259330 -0.306406 -0.301183 -0.590184 0.178963 -0.618722 0.561984 -0.713352 0.230775 -0.536731 -0.420758 0.219031 -0.350338 0.180522 -0.509629 -0.529732 -0.530784 0.233073 0.206587 0.248457 0.244820 0.188173 0.264889 0.290118 0.271143 0.232267 0.247454 0.232719 0.248204 0.240426 0.255360 0.215767 0.230236 0.253705 0.222778 0.228614
chargesum: 0.00000
title: Mulliken charges with hydrogens summed into heavy atoms:
elementType: O O O O N C C C C C C C C C C C C C
charge: -0.258917 -0.259330 -0.306406 -0.301183 -0.035177 0.178963 -0.179062 0.561984 -0.031903 0.230775 -0.265587 -0.188491 0.219031 -0.102884 0.180522 0.211719 0.171631 0.174314
polarizability: 2.04760662e+02 1.54375603e+01 1.62607519e+02 1.25666204e+01 -9.06660746e+00 1.20537736e+02
1716.lowfreq: -11.4507 0.0006 0.0008 0.0009 2.5427 8.3997 21.3334 31.7771 45.3047
frequency: 20.9576 31.7007 45.2799 52.8895 76.8507 93.8550 105.7947 121.4046 134.2777 160.0006 162.4549 178.4141 191.4318 207.8120 233.1047 237.0433 253.8194 273.8728 283.9518 314.5745 329.5808 346.1893 363.4194 375.3925 417.8751 442.6230 470.5192 491.2107 542.4683 560.2295 575.1743 605.0393 635.8411 708.3459 726.2224 739.9540 757.6703 762.6326 827.9332 862.4649 886.0324 895.7466 919.8771 929.6474 945.2308 954.7834 959.7010 984.1609 1026.0308 1089.6932 1107.3344 1111.9548 1112.9015 1113.9214 1137.8968 1146.8184 1151.2630 1154.4759 1156.6443 1169.7539 1195.0592 1204.9643 1244.6118 1267.8184 1312.8326 1339.3323 1368.3508 1387.7373 1401.4452 1419.0214 1423.2105 1441.7649 1452.0749 1456.5582 1457.4060 1458.5718 1460.6966 1468.9067 1474.2934 1477.2979 1484.0451 1487.6505 1572.1338 1596.0140 1612.0001 1639.6191 2965.6982 2970.8037 2986.1123 2989.6994 3004.4222 3051.2710 3062.0385 3066.9166 3087.9918 3107.3476 3119.5170 3119.7816 3123.5070 3128.3571 3138.4683 3151.2032 3160.6243 3452.1588 3589.7582
redmass: 4.2777 4.2990 5.5506 3.7694 3.2368 1.2072 2.4953 3.2287 3.2928 1.2966 1.4262 1.7147 2.9809 3.4584 1.3155 2.9880 2.0311 2.0424 2.4659 3.5451 3.1717 4.2381 2.8793 4.1279 3.1164 3.8942 3.7853 3.5365 4.4840 2.6010 3.5793 1.9990 4.2668 6.0245 5.6504 3.9151 4.8802 4.2386 1.7326 2.3730 3.7261 2.1723 1.6994 4.4342 5.8547 1.4746 1.9318 3.3163 1.5968 2.7229 1.8753 1.3757 1.2604 1.2460 1.6286 1.5425 1.7236 1.4967 1.4997 1.4835 1.7797 2.8334 2.4749 2.2127 1.5531 2.6084 4.8440 1.2353 2.2019 1.2042 1.1743 1.3774 1.0510 1.0570 1.1042 1.0672 1.0529 1.0504 1.0760 1.0652 2.7615 1.0579 7.1125 1.9838 6.7123 1.9522 1.0322 1.0309 1.0558 1.0444 1.0294 1.1033 1.1022 1.1042 1.0936 1.1043 1.1026 1.1026 1.1000 1.0891 1.0918 1.1051 1.0957 1.0441 1.0985
irintensity: 0.2776 0.9937 5.7560 0.5850 3.5686 1.3060 5.5108 1.3330 0.2986 0.6996 2.3588 3.1996 5.8254 10.9914 2.1193 4.4401 40.5106 10.7085 21.8850 9.2832 4.6568 1.8566 2.6471 1.7044 0.8263 3.9063 10.0483 6.1675 3.9654 63.5340 22.2973 249.5550 35.9781 11.0864 3.8883 0.5198 7.0758 8.4788 23.5026 8.1706 5.7018 9.5194 18.0810 10.7171 54.8524 7.9596 2.5754 39.8161 16.9564 40.9612 83.8830 21.1213 16.1288 1.0140 4.5766 23.2695 94.2889 34.6231 2.4380 50.2600 48.4631 17.4251 91.9110 36.6348 2.9063 17.4397 8.5421 21.4375 19.4935 13.2940 1.1006 15.8734 11.7532 15.4258 4.7437 7.0464 10.6723 8.6847 17.7555 7.3944 122.2317 29.6987 8.5406 176.0745 4.7999 33.6445 80.0529 70.2660 21.6850 39.8357 25.7705 13.0498 35.0918 25.5425 23.6140 27.5300 20.6960 29.3576 24.6540 8.0840 2.6563 12.5188 9.1037 6.8618 3.9784
temp: 298.150 k
press: 1.00000 atm
elementType: 8 8 8 8 7 6 6 6 6 6 6 6 6 6 6 6 6 6 1 1 1 1 1 1 1 1 1 1 1 1 1 1 1 1 1 1 1
symmnumber: 1
zpe: 789853.8 jmol-1
zpe.correction: 0.300839 hartree
zpe.thermalcorrener: 0.321288 hartree
zpe.thermalcorrenthalpy: 0.322232 hartree
zpe.thermalcorrgfe: 0.250880 hartree
zpe.sumelectzpe: -860.997663 hartree
zpe.sumelectthermal: -860.977214 hartree
zpe.sumelectthermalent: -860.976270 hartree
zpe.sumelectthermalfe: -861.047622 hartree
dipole: 1.2741 -0.4176 0.8321
dipole: 1.5780
quadrupole: -103.9921 -92.6862 -112.2209
quadrupole: 8.3262 -1.6982 7.2185
quadrupole: -1.0257 10.2802 -9.2545 8.3262 -1.6982 7.2185
hfenergy: -861.298502 hartree
pointgroup: C01 [X(C13H19N1O4)]
dipole: 0.5034221 -0.1551446 0.3285454 debye
polarizability: 203.4908155|16.5427273|163.9919163|13.9376162|-7.5802604|120.4231838 unknown
InChI: InChI=1S/C13H19NO4/c1-13(14,12(15)18-4)8-9-5-6-10(16-2)11(7-9)17-3/h5-7H,8,14H2,1-4H3
charge 0 multiplicity 1
37 atoms
O  -2.183501 1.274178 1.066393
O  -2.82554 1.393431 -1.160323
O  2.375922 1.525943 -0.853441
O  3.813636 -0.448074 0.770943
N  -4.113579 -1.074275 -0.66043
C  -2.78117 -0.816203 -0.070907
C  -1.62157 -1.43419 -0.970873
C  -0.195131 -1.167257 -0.519339
C  -2.741357 -1.38826 1.356955
C  -2.616474 0.714837 -0.124381
C  0.464164 0.036387 -0.878637
C  0.506704 -2.102261 0.285692
C  1.778726 0.306296 -0.447724
C  1.833455 -1.853574 0.69762
C  2.486375 -0.659901 0.324291
C  -1.958261 2.741896 1.03775
C  2.743948 2.428619 0.261172
C  4.816871 -0.33426 -0.314289
H  -1.781206 -1.042125 -1.993216
H  -1.81379 -2.524685 -0.995523
H  -1.769294 -1.199196 1.837903
H  -3.536409 -0.935884 1.970787
H  -2.907465 -2.482395 1.320199
H  -4.380639 -2.063028 -0.662252
H  -4.260802 -0.607723 -1.561968
H  -0.037025 0.787481 -1.50043
H  0.017559 -3.0394 0.57663
H  2.390876 -2.579635 1.29828
H  -1.656078 2.996993 2.062786
H  -2.886416 3.262676 0.74996
H  -1.16441 2.986652 0.311684
H  3.443059 1.933691 0.959169
H  1.835282 2.747159 0.808347
H  3.22071 3.300367 -0.212526
H  4.557883 0.485193 -1.00872
H  4.884062 -1.288864 -0.869874
H  5.772484 -0.126808 0.191092
