program: Gaussian 09
title: 000088216
version: EM64L-G09RevD.01
frameworkgroup: C1[X(C9H15NO3)]
method: RPBEPBE
basis: SDD
operation: Freq
keyword: #p
keyword: freq=noraman
keyword: PBEPBE/SDD
title: #p freq=noraman PBEPBE/SDD
converged: YES YES NO NO
title: Mulliken charges:
elementType: O O O N C C C C C C C C C H H H H H H H H H H H H H H H
charge: -0.246465 -0.278001 -0.248227 -0.100827 -0.339320 -0.350410 -0.352555 -0.318404 -0.313950 -0.281432 0.258843 -0.209904 -0.473238 0.196062 0.206884 0.213263 0.193531 0.200451 0.220048 0.195210 0.216047 0.215108 0.194351 0.242959 0.232143 0.251289 0.228847 0.247697
chargesum: 0.00000
title: Mulliken charges with hydrogens summed into heavy atoms:
elementType: O O O N C C C C C C C C C
charge: -0.246465 -0.278001 -0.248227 -0.100827 0.063626 0.056384 0.067944 0.092853 0.095510 0.193670 0.258843 0.041385 0.003306
polarizability: 1.64141773e+02 4.05695038e+00 1.01323796e+02 -2.64697617e+00 4.50832849e+00 8.13694603e+01
1716.lowfreq: -24.8667 -0.0008 -0.0008 -0.0006 6.0679 8.7980 25.5673 28.5878 49.4385
frequency: 22.6914 26.7554 48.8135 77.2166 108.0527 130.6984 193.8948 203.2096 231.0566 242.6043 283.3031 321.2167 373.1823 400.7922 434.0878 468.7855 507.2073 516.2676 596.1891 650.3046 760.1358 778.8522 791.0404 806.4139 840.3991 852.4973 897.7222 944.8704 994.8012 1001.0223 1005.0910 1026.7987 1051.7614 1058.8699 1062.3362 1082.2468 1094.5491 1110.0788 1131.7970 1137.2014 1153.3373 1190.0722 1204.8895 1249.9204 1269.1163 1285.5045 1289.1000 1294.2983 1317.6745 1333.3868 1347.2933 1363.6968 1371.2561 1397.4539 1411.1141 1443.4504 1449.0687 1451.7329 1460.3169 1470.3577 1482.2472 1624.3568 1641.6918 2864.2845 2871.7427 2895.5339 2956.0637 2959.9011 3016.3150 3029.2324 3035.1520 3041.5258 3081.5052 3084.7515 3088.7770 3104.1822 3158.2094 3220.2984
redmass: 4.2317 4.5693 4.3320 3.5143 2.4920 3.6329 2.9946 4.1036 2.8726 2.1404 3.8682 2.3701 2.9355 2.2354 5.1872 2.7950 1.7692 4.6156 2.0201 3.5383 3.5362 2.9003 1.3049 3.5032 1.6320 4.0281 2.3777 6.7101 1.4043 2.6675 1.0757 2.1782 2.4423 1.7339 1.6499 2.5918 3.4520 2.3374 4.0260 2.5717 1.8751 1.0665 1.3246 1.3070 1.2673 1.3064 1.3263 1.2895 1.3377 1.2550 1.2974 1.4504 1.2698 1.4467 1.2452 1.0823 1.0793 1.0964 1.0960 1.0825 1.0841 11.6240 4.5441 1.0704 1.0693 1.0696 1.0664 1.0665 1.0588 1.0897 1.0894 1.0892 1.0963 1.0980 1.1079 1.0599 1.0957 1.1158
irintensity: 0.2301 1.1284 0.3540 1.0041 3.0235 2.9171 5.0015 1.7504 4.2771 1.2035 11.8633 13.2046 14.7158 5.4480 5.1870 0.8600 0.0259 0.7297 4.6913 4.8375 11.2152 25.7276 0.4645 23.5573 0.2752 8.4648 8.5440 49.2984 37.6039 38.2734 48.3689 10.3478 23.5362 1.3885 21.5780 15.5602 58.5489 6.6981 493.0908 25.8436 3.7141 2.3467 0.9369 16.1879 4.8069 34.0509 21.8956 2.7796 6.5870 2.1374 4.2372 0.7656 1.9900 3.2722 79.8548 2.9341 0.4734 18.3998 4.4312 2.5089 12.2782 145.3699 21.1586 51.4007 82.3291 110.2383 34.7516 98.2079 12.7460 37.2093 39.4336 22.3761 40.5590 32.7277 35.7554 4.5205 4.3236 8.2312
temp: 298.150 k
press: 1.00000 atm
elementType: 8 8 8 7 6 6 6 6 6 6 6 6 6 1 1 1 1 1 1 1 1 1 1 1 1 1 1 1
symmnumber: 1
zpe: 611134.0 jmol-1
zpe.correction: 0.232769 hartree
zpe.thermalcorrener: 0.246397 hartree
zpe.thermalcorrenthalpy: 0.247341 hartree
zpe.thermalcorrgfe: 0.190145 hartree
zpe.sumelectzpe: -631.292872 hartree
zpe.sumelectthermal: -631.279243 hartree
zpe.sumelectthermalent: -631.278299 hartree
zpe.sumelectthermalfe: -631.335495 hartree
dipole: 1.1634 -1.9355 -0.8517
dipole: 2.4135
quadrupole: -80.9143 -75.9695 -79.2327
quadrupole: -3.3188 -6.1954 -2.8225
quadrupole: -2.2088 2.7360 -0.5272 -3.3188 -6.1954 -2.8225
hfenergy: -631.5256403 hartree
pointgroup: C01 [X(C9H15N1O3)]
dipole: -0.4509082 0.7554672 -0.3572056 debye
polarizability: 164.2611826|3.3413096|100.9125687|1.9154898|-5.2100509|81.6612783 unknown
InChI: InChI=1S/C9H15NO3/c1-2-9(11)13-8-5-10-3-6-12-7-4-10/h2H,1,3-8H2
charge 0 multiplicity 1
28 atoms
O  4.523604 -0.424849 -0.151175
O  -2.015731 0.539289 -0.1735
O  -3.182342 -1.214195 0.841181
N  1.709146 0.261179 0.078916
C  2.155608 -0.913509 -0.716973
C  2.762504 1.30994 0.082305
C  0.381792 0.775304 -0.33002
C  3.476912 -1.4599 -0.151625
C  4.072333 0.731306 0.641526
C  -0.737594 -0.075433 0.281883
C  -3.186677 -0.142539 0.187183
C  -4.375135 0.593455 -0.316945
C  -5.633408 0.135425 -0.090213
H  2.302502 -0.638769 -1.792337
H  1.38759 -1.707558 -0.671133
H  2.431175 2.149599 0.722026
H  2.951479 1.710229 -0.945587
H  0.257716 0.813085 -1.439379
H  0.274007 1.810021 0.043394
H  3.313183 -1.829118 0.883689
H  3.869676 -2.276374 -0.779772
H  4.890739 1.467665 0.58236
H  3.919727 0.423621 1.698546
H  -0.695333 -0.056753 1.384706
H  -0.713809 -1.129224 -0.048805
H  -4.177376 1.515557 -0.873181
H  -6.513755 0.672736 -0.457641
H  -5.792031 -0.791991 0.472571
