program: Gaussian 09
title: 000088231
version: EM64L-G09RevD.01
frameworkgroup: C1[X(C15H13NO5)]
method: RPBEPBE
basis: SDD
operation: Freq
keyword: #p
keyword: freq=noraman
keyword: PBEPBE/SDD
title: #p freq=noraman PBEPBE/SDD
converged: YES YES NO NO
title: Mulliken charges:
elementType: O O O O O N C C C C C C C C C C C C C C C H H H H H H H H H H H H H
charge: -0.255668 -0.287445 -0.438562 -0.191943 -0.250218 0.000592 0.351490 -0.460679 0.071966 0.218592 -0.369453 -0.361297 0.188219 -0.361284 0.211180 0.194789 -0.257523 -0.418334 -0.183683 -0.516452 -0.317992 0.267886 0.281033 0.260029 0.256682 0.223962 0.277502 0.300037 0.237773 0.368662 0.235403 0.263091 0.214533 0.247114
chargesum: 0.00000
title: Mulliken charges with hydrogens summed into heavy atoms:
elementType: O O O O O N C C C C C C C C C C C C C C C
charge: -0.255668 -0.287445 -0.069900 -0.191943 -0.250218 0.000592 0.351490 -0.192793 0.071966 0.218592 -0.088421 0.155414 0.188219 -0.137322 0.211180 0.194789 0.019979 -0.118297 0.054089 0.196574 -0.070877
polarizability: 3.06704636e+02 -1.37362304e+01 1.94957432e+02 1.44371614e+00 -3.07063228e+00 8.17438599e+01
1716.lowfreq: -5.2517 -1.8395 -0.0007 -0.0006 -0.0003 5.5764 11.1802 20.7446 36.5752
frequency: 9.1059 20.5773 36.5494 47.7429 52.4690 61.2807 94.6761 102.0519 124.7426 134.3808 188.0226 202.1242 205.6697 218.6373 266.5645 297.4333 308.3935 344.3845 361.9979 376.3679 377.1839 391.4584 429.8003 445.3088 457.7864 507.3067 513.9224 579.7574 608.4708 616.8210 636.8089 671.8997 697.9338 719.1965 720.2961 728.6482 748.9218 813.4002 832.9722 833.4922 875.5072 888.8446 931.0181 946.2984 955.8946 971.9525 980.8767 984.5187 1001.6848 1004.8991 1019.5635 1032.6312 1075.4231 1091.5969 1106.9531 1112.7528 1153.3596 1159.1040 1187.4967 1196.0368 1212.0305 1233.6033 1253.2028 1273.2665 1289.3288 1310.3790 1329.1756 1348.6356 1396.0860 1405.9555 1407.4075 1439.9337 1451.8006 1456.4821 1457.5494 1477.8461 1501.0579 1549.9111 1578.4914 1586.0462 1601.6524 1614.5691 1622.7828 2982.9357 2988.6377 3045.8749 3094.7731 3113.5031 3134.5894 3135.6464 3153.2472 3159.0520 3162.9634 3169.3354 3173.9623 3573.5537
redmass: 6.7917 5.6426 6.3682 5.3263 2.5405 5.3697 6.7031 5.6160 2.3270 2.1368 3.1239 4.8992 3.6243 6.2644 4.3311 5.3642 8.2238 4.1091 7.5625 1.1930 2.9017 6.6903 4.7208 6.9370 3.2775 4.1680 5.0175 4.4783 7.8955 7.5399 3.4717 8.2067 7.1800 6.4810 1.8260 3.6795 6.8490 1.4092 1.7587 7.9237 5.8246 1.5301 8.1463 1.3525 1.4428 1.5078 1.9906 6.0305 3.6966 1.3842 4.0102 2.6994 2.2413 4.0964 1.6595 1.2375 1.3324 1.1685 2.1126 1.3248 1.0778 2.3718 2.7265 3.6170 1.5352 11.1992 1.2667 1.7647 3.1606 6.5898 2.1416 1.2852 1.2202 1.5293 1.1914 1.0548 3.1030 5.8984 7.0010 5.9073 7.4179 8.8814 9.8886 1.0347 1.0569 1.1031 1.0973 1.0902 1.0887 1.1052 1.0913 1.0912 1.0935 1.0945 1.1004 1.0660
irintensity: 0.0704 1.6749 0.9336 1.3434 3.3711 8.5623 1.2131 0.7676 0.5496 6.5951 0.6702 4.6246 4.3783 18.3164 15.0151 4.8323 1.9990 14.5087 1.5963 136.1222 0.2554 2.6636 2.9596 2.1380 3.2711 0.6041 7.3312 7.1830 4.8652 44.4550 12.5293 4.0320 6.4212 9.3858 62.9816 2.8320 4.1967 44.0510 20.5588 1.9874 12.1058 21.2855 86.7419 0.9800 0.2419 3.6689 1.9406 90.8374 33.5922 0.5959 35.3302 16.4018 350.4801 225.1436 3.9886 4.3919 16.2778 27.9166 53.1525 5.5691 0.0970 511.8420 289.1867 164.6677 11.6040 1.8528 7.5373 129.8818 32.6763 1.3975 27.2881 6.0875 38.2556 7.2614 7.3317 29.6010 26.0288 0.7652 258.9600 32.6910 87.5643 155.0531 27.6821 79.6809 39.1204 7.8387 35.3814 17.5442 11.3625 12.8104 7.7496 2.6124 2.2455 4.0630 20.7496 66.7078
temp: 298.150 k
press: 1.00000 atm
elementType: 8 8 8 8 8 7 6 6 6 6 6 6 6 6 6 6 6 6 6 6 6 1 1 1 1 1 1 1 1 1 1 1 1 1
symmnumber: 1
zpe: 658820.8 jmol-1
zpe.correction: 0.250932 hartree
zpe.thermalcorrener: 0.270559 hartree
zpe.thermalcorrenthalpy: 0.271503 hartree
zpe.thermalcorrgfe: 0.198781 hartree
zpe.sumelectzpe: -1008.728768 hartree
zpe.sumelectthermal: -1008.709140 hartree
zpe.sumelectthermalent: -1008.708196 hartree
zpe.sumelectthermalfe: -1008.780918 hartree
dipole: -4.7891 1.2820 0.9190
dipole: 5.0422
quadrupole: -74.9766 -125.9782 -123.2325
quadrupole: 22.6827 -6.4790 3.8076
quadrupole: 33.0859 -17.9158 -15.1701 22.6827 -6.4790 3.8076
hfenergy: -1008.9796992 hartree
pointgroup: C01 [X(C15H13N1O5)]
dipole: -1.857167 -0.5667988 -0.4061743 debye
polarizability: 305.5787534|17.5805686|196.0526575|3.7900497|-2.1925781|81.7745178 unknown
InChI: InChI=1S/C15H13NO5/c1-20-14-7-10(4-5-12(14)17)13(18)9-21-15(19)11-3-2-6-16-8-11/h2-8,17H,9H2,1H3
charge 0 multiplicity 1
34 atoms
O  1.728004 0.143554 -0.006269
O  -4.461481 -2.07889 0.116443
O  -6.249401 0.193098 0.011749
O  -0.071612 2.118996 -0.13673
O  2.373918 -2.094648 0.135895
N  5.601735 1.570557 -0.036297
C  -2.042144 0.72667 -0.076708
C  -2.618476 -0.570507 -0.025442
C  -0.565138 0.959637 -0.076876
C  -4.015871 -0.758892 -0.018798
C  -2.900075 1.857432 -0.137126
C  0.325706 -0.289469 0.00046
C  -4.862333 0.391027 -0.053547
C  -4.29261 1.686304 -0.12794
C  4.063381 -0.332165 0.058925
C  2.678126 -0.877385 0.068903
C  5.152614 -1.236575 0.136791
C  4.335996 1.060474 -0.025813
C  6.463647 -0.720667 0.127331
C  -5.595911 -2.542422 -0.713014
C  6.638632 0.681462 0.039794
H  -2.009716 -1.479359 0.015619
H  -2.448863 2.852896 -0.185283
H  0.118361 -0.867739 0.921468
H  0.139327 -0.961321 -0.859532
H  -4.953933 2.562537 -0.161811
H  4.950597 -2.310663 0.202545
H  3.51401 1.780127 -0.086517
H  7.33327 -1.382035 0.18601
H  -6.72721 1.059896 0.021239
H  -5.674635 -3.617746 -0.494232
H  -6.526091 -2.018856 -0.443627
H  -5.374338 -2.39213 -1.786857
H  7.642314 1.121905 0.029545
