program: Gaussian 09
title: 000088223
version: EM64L-G09RevD.01
frameworkgroup: C1[X(C11H20N2O5S)]
method: RPBEPBE
basis: SDD
operation: Freq
keyword: #p
keyword: freq=noraman
keyword: PBEPBE/SDD
title: #p freq=noraman PBEPBE/SDD
converged: YES YES NO NO
title: Mulliken charges:
elementType: S O O O O O N N C C C C C C C C C C C H H H H H H H H H H H H H H H H H H H H
charge: 0.141492 -0.326056 -0.308537 -0.421871 -0.237903 -0.278227 -0.402824 -0.291394 0.336040 -0.143457 -0.710465 -0.702975 -0.710490 -0.660130 0.324895 0.179043 -0.654103 0.270449 -0.785879 0.297866 0.221907 0.268961 0.209408 0.228965 0.226887 0.204356 0.209734 0.219065 0.269258 0.316085 0.310949 0.361930 0.311235 0.268223 0.313042 0.389614 0.283767 0.256361 0.214780
chargesum: 0.00000
title: Mulliken charges with hydrogens summed into heavy atoms:
elementType: S O O O O O N N C C C C C C C C C C C
charge: 0.141492 -0.326056 -0.308537 -0.032256 -0.237903 -0.278227 -0.040894 0.021648 0.336040 0.154409 -0.010189 -0.042767 -0.012434 -0.033097 0.324895 0.179043 -0.074645 0.270449 -0.030971
polarizability: 2.18421716e+02 6.72581641e+00 1.43061704e+02 5.88733772e+00 -3.67023710e+00 1.49480608e+02
1716.lowfreq: -15.6494 -7.3512 0.0022 0.0024 0.0024 2.7154 17.1043 23.5518 28.3464
frequency: 14.2316 23.4488 28.3274 46.5973 55.1269 66.9106 74.7715 80.1730 88.6726 93.6400 111.3838 127.2328 149.0778 172.6011 181.1357 199.0927 238.5791 239.4851 251.2355 282.5373 287.7987 305.0948 322.7442 326.0092 332.1613 404.7697 434.3068 437.5602 440.4582 457.7591 512.2155 543.5932 551.2169 554.5366 596.0398 602.2257 606.4418 641.3150 659.3782 696.6637 700.0008 711.3504 745.8674 808.1180 821.0820 836.8498 912.4877 915.3702 920.4945 955.8015 962.2664 969.8720 991.5021 999.2512 1032.2538 1033.5049 1043.0277 1076.3147 1109.9873 1138.4032 1165.7214 1190.0103 1217.4382 1223.2921 1234.6495 1243.5140 1257.0811 1270.2919 1280.6906 1303.7969 1317.5830 1329.7302 1375.7209 1377.7713 1379.1791 1400.9630 1427.3418 1433.5394 1446.0106 1449.7429 1465.4042 1467.2874 1467.6798 1469.6210 1472.4547 1479.7502 1479.8754 1502.5055 1626.1482 1630.8112 1664.1272 2972.3381 2988.9585 2990.1303 2995.3622 2995.8805 3043.2833 3052.9926 3081.1835 3084.2778 3086.5878 3096.6365 3098.6231 3112.2303 3116.1056 3130.2032 3131.1987 3133.2872 3527.1259 3550.1409 3580.8656
redmass: 4.4822 4.6829 4.3575 7.2841 5.2627 5.3874 7.1928 1.4962 2.3257 5.5955 3.9138 4.0620 5.4501 4.4572 1.1793 4.1542 1.1045 3.0505 1.0689 2.6961 4.3144 3.1324 4.2271 3.7241 2.6624 2.7536 2.8709 3.1763 2.8612 2.8177 4.0228 1.4259 2.3245 3.6346 1.6361 3.3050 2.1034 1.8530 4.5085 7.1410 5.3488 9.5726 4.7479 2.8448 2.7034 2.9102 2.7555 1.5958 1.6511 1.2040 2.0605 2.1518 2.6640 3.7987 1.4170 1.4330 1.6525 1.8967 3.9121 1.9814 1.9481 1.8238 1.8075 1.2140 1.6034 1.5195 3.0290 2.4597 1.6596 1.3170 1.5615 1.7105 1.2283 1.2317 1.2418 1.2177 1.0917 1.0947 1.0465 1.2455 1.0874 1.0793 1.1814 1.2850 1.2301 1.2370 1.2211 1.0609 5.9989 8.6918 9.1074 1.0809 1.0361 1.0356 1.0363 1.0369 1.0588 1.0576 1.0993 1.0992 1.0983 1.0992 1.1004 1.1004 1.0996 1.1072 1.0993 1.1081 1.0643 1.0776 1.0779
irintensity: 0.8896 0.4204 0.1645 10.3930 3.2094 2.8528 3.9511 3.1013 2.0374 2.5377 5.8922 7.8871 0.5711 1.3855 0.2469 7.6798 0.6746 7.3383 0.3694 2.9587 5.4611 11.6362 4.8101 1.8300 3.1114 0.1151 3.1846 0.5285 22.4137 10.1735 44.1734 87.7006 14.8153 15.5807 180.2867 13.7902 8.5213 125.2471 71.6092 10.7830 28.5952 21.6571 8.3845 7.4605 9.5274 4.2699 29.4202 1.1596 0.6495 0.3939 42.3016 46.0731 39.8463 183.8190 0.0924 11.1396 14.4319 170.3619 55.9447 120.3510 379.7561 6.0860 27.8930 29.8964 93.0675 50.5291 28.0096 38.8988 38.7364 26.7247 31.8070 16.8192 42.4399 39.2908 70.0742 40.8799 40.7181 4.1342 0.7074 163.8520 28.3058 31.3152 138.3423 219.8877 137.3615 31.1595 60.5458 51.4389 123.4612 229.9879 203.9937 15.3566 25.1842 10.0624 32.7315 10.0127 22.4148 4.1814 9.9597 18.6261 10.6350 59.3968 31.0212 4.6193 17.2301 1.4879 8.0830 1.3432 33.4721 15.8425 67.8529
temp: 298.150 k
press: 1.00000 atm
elementType: 16 8 8 8 8 8 7 7 6 6 6 6 6 6 6 6 6 6 6 1 1 1 1 1 1 1 1 1 1 1 1 1 1 1 1 1 1 1 1
symmnumber: 1
zpe: 817871.9 jmol-1
zpe.correction: 0.311511 hartree
zpe.thermalcorrener: 0.334661 hartree
zpe.thermalcorrenthalpy: 0.335605 hartree
zpe.thermalcorrgfe: 0.255982 hartree
zpe.sumelectzpe: -1313.392382 hartree
zpe.sumelectthermal: -1313.369232 hartree
zpe.sumelectthermalent: -1313.368288 hartree
zpe.sumelectthermalfe: -1313.447912 hartree
dipole: -0.5665 3.4164 -4.1567
dipole: 5.4103
quadrupole: -106.3993 -116.9310 -125.9639
quadrupole: 10.2836 -12.7374 0.3640
quadrupole: 10.0321 -0.4996 -9.5325 10.2836 -12.7374 0.3640
hfenergy: -1313.7038933 hartree
pointgroup: C01 [X(C11H20N2O5S1)]
dipole: -0.3543283 1.3588944 -1.5995721 debye
polarizability: 216.7129465|13.1542908|145.0226601|6.013895|-3.3381047|149.2284217 unknown
InChI: InChI=1S/C11H20N2O5S/c1-7(14)12-6-19-5-8(9(15)16)13-10(17)18-11(2,3)4/h8,12-13,15H,5-6H2,1-4H3
charge 0 multiplicity 1
39 atoms
S  1.56899 -1.260485 -1.378654
O  -3.200182 -0.229296 -0.426688
O  -1.990324 -0.766092 1.552303
O  0.387652 2.383032 -1.145009
O  2.221658 2.006681 0.221875
O  4.55139 -1.151551 1.441993
N  -1.031076 0.381925 -0.241271
N  4.210298 -0.419335 -0.744405
C  -4.503077 -0.877211 0.029176
C  0.263641 0.521432 0.424289
C  -4.274401 -2.38587 0.249322
C  -5.422742 -0.612849 -1.175242
C  -5.010604 -0.163172 1.297953
C  1.108183 -0.779089 0.399474
C  -2.075086 -0.255611 0.399716
C  1.071952 1.685501 -0.146197
C  3.445929 -1.580699 -1.141867
C  4.695806 -0.254427 0.558512
C  5.379581 1.07993 0.819151
H  0.081098 0.744576 1.497346
H  -3.855035 -2.849996 -0.660914
H  -3.587186 -2.561364 1.091859
H  -5.240492 -2.874661 0.472322
H  -5.011536 -1.078387 -2.087375
H  -5.527597 0.471347 -1.353223
H  -6.42441 -1.037077 -0.983204
H  -6.012339 -0.549325 1.561596
H  -5.096396 0.923583 1.120038
H  -4.330017 -0.336503 2.146216
H  2.041978 -0.644084 0.966614
H  0.517062 -1.592088 0.846743
H  -1.181539 0.809463 -1.155362
H  3.569976 -2.351685 -0.36753
H  3.757838 -1.964011 -2.126998
H  4.255263 0.376189 -1.383856
H  0.95411 3.126741 -1.485262
H  4.604428 1.841949 1.018759
H  6.024168 0.986821 1.705552
H  5.98554 1.417399 -0.040651
