program: Gaussian 09
title: 000088253
version: EM64L-G09RevD.01
frameworkgroup: C1[X(C21H13NO4)]
method: RPBEPBE
basis: SDD
operation: Freq
keyword: #p
keyword: freq=noraman
keyword: PBEPBE/SDD
title: #p freq=noraman PBEPBE/SDD
converged: YES YES NO NO
title: Mulliken charges:
elementType: O O O O N C C C C C C C C C C C C C C C C C C C C C H H H H H H H H H H H H H
charge: -0.258580 -0.195919 -0.441807 -0.263879 -0.493595 0.044608 0.313606 0.292903 0.287056 0.263726 -0.120516 -0.259725 -0.426801 -0.388386 -0.227816 -0.380726 -0.374524 0.308572 -0.227444 -0.228136 0.067314 -0.375947 -0.299063 -0.221555 -0.248266 0.116948 0.295069 0.282412 0.439345 0.239414 0.294628 0.290448 0.239302 0.239545 0.280647 0.279005 0.234268 0.237618 0.386253
chargesum: 0.00000
title: Mulliken charges with hydrogens summed into heavy atoms:
elementType: O O O O N C C C C C C C C C C C C C C C C C C C C C
charge: -0.258580 -0.195919 -0.055554 -0.263879 -0.054250 0.044608 0.313606 0.292903 0.287056 0.263726 -0.120516 -0.259725 -0.131732 -0.105974 0.011598 -0.086098 -0.084076 0.308572 0.011858 0.011408 0.067314 -0.095301 -0.020058 0.012713 -0.010648 0.116948
polarizability: 4.79684401e+02 -1.85278316e+01 2.91131718e+02 -8.79855722e+00 -2.07825151e+00 1.22663682e+02
1716.lowfreq: -5.3052 -0.5250 -0.0007 -0.0005 0.0002 4.3872 27.1160 31.2945 48.0388
frequency: 27.0625 31.2447 48.0343 64.3458 74.3188 100.2748 127.4193 134.7863 162.3812 170.4491 176.0029 221.4835 250.4513 258.2935 274.5354 316.7243 335.7413 362.5423 396.4800 404.5340 419.6382 420.7106 426.5108 435.7633 470.3218 490.6402 503.8781 518.9377 543.1236 575.0149 583.5985 595.1518 606.2119 633.4169 659.7703 670.3677 681.2529 693.8881 719.4313 725.4145 739.4508 756.8682 771.0173 780.3024 785.2033 801.6836 818.5029 830.5001 870.3122 885.9108 889.6980 909.9708 931.3125 953.0304 977.0223 993.4698 998.3014 998.7444 1004.2717 1006.3964 1015.3570 1036.4115 1048.3381 1081.7366 1086.5557 1112.4554 1159.3328 1164.5622 1169.8787 1179.4795 1187.1063 1197.6473 1239.3988 1245.7631 1281.8463 1302.7365 1307.4433 1320.1990 1337.7361 1371.5252 1392.2811 1398.2594 1417.1253 1432.2348 1439.9117 1449.5121 1470.0540 1474.3478 1497.1329 1533.9721 1546.1603 1573.3401 1582.0713 1585.7905 1603.4927 1608.0232 1615.6352 1635.7023 3136.1721 3136.2247 3141.8829 3151.9607 3157.2477 3163.8926 3166.3759 3170.0328 3172.5188 3176.3717 3176.9870 3183.5849 3529.7700
redmass: 6.4484 7.2370 7.0926 7.7264 8.1197 5.7466 5.0408 5.4148 6.4677 6.8568 5.8918 4.5757 6.0543 5.4567 5.4689 6.7325 6.1669 8.0231 8.6879 11.5664 4.0667 3.4139 4.0617 6.7860 11.0607 3.7093 5.9022 3.6484 4.2033 6.2070 1.2266 5.4366 5.8740 6.2201 4.6933 5.7131 4.9018 5.0253 2.9595 2.0887 2.9535 2.0291 2.7639 1.9359 4.5969 1.6161 1.8004 4.7436 2.2084 1.6523 4.2906 6.2105 1.5502 1.7438 1.3784 1.4256 1.7932 2.5355 1.8091 2.5239 1.3685 2.1123 2.2294 2.1287 2.3716 1.8795 2.1983 1.6698 1.1326 1.0973 1.4304 1.5852 1.8221 1.8901 2.4326 2.5177 2.2770 2.6414 2.4757 5.9119 9.8048 7.2753 4.2652 2.8340 2.6655 2.8716 2.7398 2.6062 4.1502 4.5727 5.3359 7.2875 4.0633 4.6423 6.4252 6.3507 6.6003 5.4576 1.0863 1.0868 1.0877 1.0904 1.0905 1.0947 1.0932 1.0944 1.0997 1.0803 1.0973 1.0980 1.0641
irintensity: 1.6653 0.4753 1.5586 2.6880 0.7051 0.7018 0.6492 0.0904 0.0797 0.4522 1.6432 1.5941 2.7427 1.4330 9.6421 2.3577 1.7038 9.4390 13.3687 9.7220 8.7594 0.6321 4.6836 5.2084 0.8581 2.6446 24.6423 2.9138 14.0854 14.2879 103.6783 32.8156 15.9879 3.4856 3.3600 12.3271 27.6647 16.1795 47.4627 4.5689 24.5722 52.2130 83.1899 50.4160 2.6644 1.9143 57.2164 7.6686 3.7934 4.7483 35.8197 1.5952 0.4506 0.8369 5.7803 37.8094 88.3585 209.5264 25.7655 42.9357 0.0448 1.3932 21.3226 13.2019 0.5449 140.4954 15.2477 130.6906 10.0581 4.4608 7.5191 0.8085 24.5454 17.5968 303.1072 103.4455 307.8209 126.9779 329.9514 18.6113 7.9798 36.3125 23.6206 10.8006 42.7756 6.7112 3.0914 20.1053 435.5502 256.5318 194.0670 65.0872 311.1978 119.8650 25.3912 1.9180 11.9399 129.3729 3.8074 6.8649 13.4969 9.0939 17.1322 2.9934 3.9988 4.4700 40.0064 96.1918 3.1948 11.2216 61.6723
temp: 298.150 k
press: 1.00000 atm
elementType: 8 8 8 8 7 6 6 6 6 6 6 6 6 6 6 6 6 6 6 6 6 6 6 6 6 6 1 1 1 1 1 1 1 1 1 1 1 1 1
symmnumber: 1
zpe: 751109.5 jmol-1
zpe.correction: 0.286082 hartree
zpe.thermalcorrener: 0.306123 hartree
zpe.thermalcorrenthalpy: 0.307068 hartree
zpe.thermalcorrgfe: 0.236620 hartree
zpe.sumelectzpe: -1161.976190 hartree
zpe.sumelectthermal: -1161.956149 hartree
zpe.sumelectthermalent: -1161.955205 hartree
zpe.sumelectthermalfe: -1162.025652 hartree
dipole: -2.4102 0.2674 0.9307
dipole: 2.5974
quadrupole: -128.8925 -135.3311 -149.3065
quadrupole: -16.9323 2.1359 2.3683
quadrupole: 8.9509 2.5123 -11.4631 -16.9323 2.1359 2.3683
hfenergy: -1162.2622725 hartree
pointgroup: C01 [X(C21H13N1O4)]
dipole: 0.9482194 -0.0736103 0.3738358 debye
polarizability: 480.0416836|-15.6940094|290.4502152|10.8208108|-6.966211|122.9879031 unknown
InChI: InChI=1S/C21H13NO4/c23-19-12-6-1-2-7-13(12)20(24)18-15(19)9-5-11-17(18)22-16-10-4-3-8-14(16)21(25)26/h1-11,22,25H
charge 0 multiplicity 1
39 atoms
O  -0.484969 1.775106 0.113337
O  -4.213936 -2.26352 -0.329429
O  4.653652 2.61722 -1.379064
O  2.36181 2.365786 -1.163946
N  1.489081 0.029677 -0.015726
C  -0.896693 -0.595951 -0.126905
C  -1.880967 -1.630055 -0.279961
C  0.505178 -0.952365 -0.166124
C  -2.785698 1.096987 0.197829
C  -3.763005 0.070125 0.068449
C  -1.326803 0.804753 0.067218
C  -3.350371 -1.337262 -0.195224
C  -1.501027 -2.9675 -0.504951
C  0.85487 -2.313599 -0.43516
C  -0.130242 -3.297551 -0.601392
C  -3.199417 2.43107 0.437031
C  -5.139707 0.386303 0.181963
C  2.836111 -0.165702 0.346912
C  -4.569587 2.738049 0.554051
C  -5.543111 1.713504 0.426376
C  3.854762 0.767108 -0.063655
C  3.224242 -1.251629 1.187957
C  5.203941 0.558251 0.336069
C  4.562586 -1.433261 1.573872
C  5.568906 -0.534388 1.139039
C  3.518201 1.944851 -0.892441
H  -2.287515 -3.71909 -0.616964
H  1.907942 -2.579628 -0.555832
H  1.160205 1.008228 -0.165219
H  0.172075 -4.326683 -0.822497
H  -2.428123 3.202416 0.523312
H  -5.866381 -0.425036 0.073715
H  -4.884373 3.770144 0.742121
H  -6.607425 1.955894 0.515962
H  2.456047 -1.926337 1.575186
H  5.953366 1.279236 -0.000417
H  4.820123 -2.269089 2.233944
H  6.611291 -0.677928 1.439199
H  4.345364 3.404767 -1.902737
