program: Gaussian 09
title: 000088187
version: EM64L-G09RevD.01
frameworkgroup: C1[X(C8H12N2O3S)]
method: RPBEPBE
basis: SDD
operation: Freq
keyword: #p
keyword: freq=noraman
keyword: PBEPBE/SDD
title: #p freq=noraman PBEPBE/SDD
converged: YES YES NO NO
title: Mulliken charges:
elementType: S O O O N N C C C C C C C C H H H H H H H H H H H H
charge: 0.983665 -0.562381 -0.500038 -0.538015 -0.320010 -0.694682 0.516698 -0.303110 -0.488654 0.560889 -0.620076 -0.398867 -0.215540 -0.623575 0.229800 0.199242 0.235947 0.288112 0.275503 0.266308 0.313581 0.367179 0.228837 0.227479 0.193152 0.378558
chargesum: 0.00000
title: Mulliken charges with hydrogens summed into heavy atoms:
elementType: S O O O N N C C C C C C C C
charge: 0.983665 -0.183823 -0.500038 -0.538015 -0.053703 -0.013922 0.516698 -0.303110 -0.059613 0.560889 -0.384128 -0.110755 0.059963 0.025893
polarizability: 2.03004661e+02 4.88835814e-01 1.41996457e+02 -3.54272705e+00 9.46629144e-02 8.69233579e+01
1716.lowfreq: -7.1335 -4.6272 -0.0013 0.0004 0.0009 5.4684 34.3567 48.9664 68.2547
frequency: 33.8537 48.8296 68.2092 82.5187 116.4092 161.2559 173.2951 186.7529 225.6161 229.1187 232.8126 272.0735 287.9026 318.3879 328.8457 344.8830 360.1503 414.9831 444.7758 459.5973 508.4579 539.9484 547.7038 594.6947 643.5969 669.9998 683.0133 739.9230 749.1558 813.6901 825.1988 875.0759 924.1760 946.4781 967.6498 978.2654 982.7819 986.5315 1045.2333 1075.9544 1108.4651 1133.4914 1145.4730 1166.0987 1189.2356 1234.6387 1277.9788 1313.9648 1349.6217 1392.6717 1434.5925 1450.6137 1461.2795 1465.3071 1475.1885 1480.9470 1494.6498 1570.4440 1622.4346 1646.4581 2852.6484 2879.1781 2970.8442 3014.8437 3080.2278 3117.7923 3150.2393 3179.1892 3404.9865 3465.9306 3473.1646 3652.2722
redmass: 4.0177 4.7557 3.1857 2.3873 4.3798 4.5265 1.9757 3.2638 1.8753 2.7114 3.7967 2.6783 4.8992 3.1656 5.6978 6.7197 5.0705 6.4682 1.4811 2.0804 3.9734 8.0693 7.2462 3.5864 5.1316 1.3352 1.2101 2.7270 4.5359 12.2690 1.3179 1.6383 2.9765 8.0997 1.3821 2.4840 2.1556 3.0034 1.1781 1.6376 1.3303 1.7018 1.2090 2.5785 1.9689 1.3232 1.5231 2.4436 1.4311 5.2655 1.1517 1.2160 2.9932 1.1513 1.2465 2.3524 1.0500 5.5165 2.7443 1.5975 1.0712 1.0562 1.0851 1.0764 1.0990 1.0909 1.0894 1.0956 1.0580 1.0750 1.0660 1.0930
irintensity: 1.3305 1.8339 0.6459 2.0597 1.2569 1.7909 42.7722 3.5596 2.4270 1.7998 2.0636 68.4529 12.8356 7.3265 7.3024 13.8909 7.2654 24.0561 86.1612 57.2255 27.7840 109.3304 43.8724 66.7779 2.5018 94.2676 169.6263 15.5179 4.1689 91.8098 39.2816 29.5144 30.0649 63.1660 13.1026 6.8376 24.9072 12.0679 84.4474 7.1434 1.5655 19.5979 6.9102 26.6534 8.2069 6.1409 26.9689 8.5615 4.2776 29.7927 1.5392 29.7646 2.6544 34.3637 27.6651 40.3534 15.5652 51.5220 29.6501 318.2344 72.0930 192.0225 22.1674 45.0449 35.4187 12.5637 2.6522 0.3240 120.7008 0.1482 38.0341 60.5586
temp: 298.150 k
press: 1.00000 atm
elementType: 16 8 8 8 7 7 6 6 6 6 6 6 6 6 1 1 1 1 1 1 1 1 1 1 1 1
symmnumber: 1
zpe: 517640.1 jmol-1
zpe.correction: 0.197159 hartree
zpe.thermalcorrener: 0.212605 hartree
zpe.thermalcorrenthalpy: 0.213549 hartree
zpe.thermalcorrgfe: 0.154131 hartree
zpe.sumelectzpe: -1044.036161 hartree
zpe.sumelectthermal: -1044.020715 hartree
zpe.sumelectthermalent: -1044.019771 hartree
zpe.sumelectthermalfe: -1044.079190 hartree
dipole: -4.6476 3.1474 0.8243
dipole: 5.6732
quadrupole: -84.4899 -84.4062 -95.2170
quadrupole: 0.0337 9.6752 -2.0101
quadrupole: 3.5478 3.6315 -7.1793 0.0337 9.6752 -2.0101
hfenergy: -1044.2333201 hartree
pointgroup: C01 [X(C8H12N2O3S1)]
dipole: -1.8326414 1.1772178 0.4872972 debye
dipolederiv: 2.116207 -0.3281121 0.0581144 -0.3078319 1.3001528 -0.0705287 0.3476513 -0.1856478 1.6027151 -0.6193138 0.0725807 -0.2629987 0.0744632 -0.572002 0.1123166 -0.4493942 0.1965541 -0.9198533 -0.6699208 0.0977348 0.0239838 0.1671107 -0.6082904 -0.138563 0.0109962 -0.050385 -0.5344022 -0.7673035 -0.03446 0.0390747 -0.064337 -0.6699865 0.1040486 -0.0202433 0.0365072 -0.5067821 -0.8831332 0.0290115 -0.0368036 0.0298791 -0.5491711 -0.1016938 -0.063424 -0.0941162 -0.2152181 -0.6270738 -0.5769986 -0.1209643 -0.4583751 -0.9989674 -0.0021823 -0.0993834 -0.0590717 -0.611944 0.3931732 0.0612815 -0.0694208 -0.1969582 0.4051098 0.0368093 -0.2295074 0.0356293 0.0252644 -0.4385839 0.2539298 0.0483602 -0.3256962 -0.3779603 0.0157361 0.1159666 -0.0911017 -0.2585182 0.2835022 0.0738284 0.1292678 0.0134945 0.4698375 0.0462928 0.3906602 0.0991061 0.2840384 0.4262946 0.8044057 0.0886883 0.2721051 0.9983618 0.0713423 0.0200305 0.0283148 0.1764458 -0.3782152 -0.5237548 -0.0650953 0.0278884 -0.128756 0.0193232 0.0159991 0.0788328 -0.2135161 -0.5657167 0.269143 0.0389488 0.1876223 -0.2449105 -0.019571 0.0691079 -0.0176263 -0.2029687 0.3849697 -0.1876364 -0.0544356 0.5063175 -0.0459474 -0.0216306 0.0027197 0.0466303 -0.0484826 0.65417 -0.0855938 -0.028818 -0.0460944 0.3122518 -0.0305589 -0.1932065 -0.0519743 0.150706 -0.042538 -0.0053139 0.0745104 -0.0543572 0.044631 0.057708 0.0202827 0.0166682 -0.1072009 -0.0488849 0.0172237 -0.0241972 -0.0036544 -0.2864969 -0.0507618 -0.0907687 0.002423 0.0356119 0.0256589 0.0572746 0.0148179 0.0649168 -0.0791087 -0.0336227 0.0164142 -0.0263546 0.1581082 0.1019698 -0.0576669 0.0087362 -0.0633204 0.0282517 -0.0179572 0.0316492 -0.0287051 0.162342 0.1106671 0.0625293 0.0168169 0.0324404 0.0570263 -0.0127991 0.0012219 -0.0285062 0.1408741 0.1656799 -0.0626516 0.0152604 -0.1312223 0.2252215 0.1014801 0.0356671 0.0162962 0.0144332 0.1477492 0.0623735 0.0360879 0.0598396 0.2389356 -0.0228054 0.0427041 -0.0141369 0.3580541 0.3336893 -0.0590912 0.0225163 -0.03481 0.2828928 -0.0239979 0.0084384 0.0563984 0.3301563 0.040815 0.0041163 0.0006791 0.014621 0.0601915 0.0814494 0.1175831 0.0995263 -0.1394374 -0.0445887 -0.0591742 -0.0533265 -0.0976139 0.0024107 -0.1139287 -0.1286163 -0.1112905 -0.0016119 -0.2079854 0.0682576 -0.007674 0.2736734 -0.1918572 0.0309786 0.0402294 0.0257017 0.0701345 0.1087123 0.0467632 0.1078708 0.059899 0.3281796 -0.0168839 -0.0127779 0.0203276 0.2510513 unknown
polarizability: 203.07298|0.8262619|140.6859099|-2.0382601|8.400851|88.1655859 unknown
InChI: InChI=1S/C8H12N2O3S/c1-10-5-6-2-3-8(7(9)4-6)14(11,12)13/h2-4,10-11H,5,9H2,1H3
charge 0 multiplicity 1
26 atoms
S  2.86553 -0.401628 -0.165857
O  3.20314 -0.716453 1.641634
O  3.173598 -1.769052 -0.971233
O  3.669913 0.960626 -0.570835
N  -3.987415 -0.475053 -0.456543
N  1.374347 2.359551 0.263594
C  -1.711026 0.244612 0.236524
C  1.051876 -0.07752 -0.029159
C  -3.214029 0.418799 0.423752
C  0.562317 1.247369 0.192069
C  -0.860248 1.359751 0.317457
C  -1.171071 -1.052123 -0.000829
C  0.216486 -1.210312 -0.12571
C  -5.438368 -0.493436 -0.202767
H  -3.476359 0.15179 1.469335
H  -3.479795 1.500238 0.307885
H  -1.285438 2.358844 0.477842
H  -1.853848 -1.901251 -0.084731
H  0.664491 -2.192889 -0.30722
H  -3.757109 -0.333167 -1.447791
H  0.965023 3.274307 0.432256
H  2.376582 2.274671 0.055138
H  -5.630401 -0.879933 0.815741
H  -5.929229 -1.177725 -0.916498
H  -5.935761 0.504174 -0.282262
H  4.168195 -0.974988 1.718606
