program: Gaussian 09
title: 000088395
version: EM64L-G09RevD.01
frameworkgroup: C1[X(C22H15NO6)]
method: RPBEPBE
basis: SDD
operation: Freq
keyword: #p
keyword: freq=noraman
keyword: PBEPBE/SDD
title: #p freq=noraman PBEPBE/SDD
converged: YES YES NO NO
title: Mulliken charges:
elementType: O O O O O O N C C C C C C C C C C C C C C C C C C C C C C H H H H H H H H H H H H H H H
charge: -0.329330 -0.362399 -0.304049 -0.178674 -0.281328 -0.222986 -0.647081 0.234616 0.215438 0.270908 0.255153 -0.125542 0.051221 -0.218502 0.125447 0.206571 -0.569651 -0.380761 -0.383372 -0.232430 -0.228846 0.345116 -0.348907 -0.360066 -0.298068 -0.369223 0.356713 0.261582 -0.746959 0.260818 0.289455 0.291696 0.235381 0.235517 0.334502 0.388152 0.356850 0.274768 0.266219 0.308909 0.263434 0.254532 0.250264 0.254914
chargesum: 0.00000
title: Mulliken charges with hydrogens summed into heavy atoms:
elementType: O O O O O O N C C C C C C C C C C C C C C C C C C C C C C
charge: -0.329330 -0.005549 -0.304049 -0.178674 -0.281328 -0.222986 0.075573 0.234616 0.215438 0.270908 0.255153 -0.125542 0.051221 -0.218502 0.125447 0.206571 -0.308833 -0.091306 -0.091676 0.002951 0.006671 0.345116 -0.074139 -0.093848 0.010841 -0.105789 0.356713 0.261582 0.012750
polarizability: 5.36419584e+02 6.69142056e+00 2.62052696e+02 2.59507476e+01 3.36786846e+00 1.47258082e+02
1716.lowfreq: -5.1726 -3.2083 -0.0005 0.0005 0.0006 6.2262 10.5648 18.4372 21.9697
frequency: 10.2076 18.3823 21.9538 40.1820 44.5019 56.2819 63.3006 76.8008 105.6520 132.7839 140.6808 150.9478 165.5249 172.3499 204.7765 212.9930 263.6701 288.7745 299.1203 318.3345 327.8701 341.4824 362.1220 369.7898 383.3618 396.8755 415.4237 417.1183 422.1179 431.1212 442.6878 450.5025 480.3138 494.3583 505.0278 508.4544 538.7866 553.5795 560.8906 593.0010 607.3918 627.0929 633.3826 645.7803 673.0226 678.4573 709.1470 720.3104 731.2395 736.6420 745.0676 798.1194 811.1725 822.1745 826.9083 833.7693 838.6294 858.2850 864.6218 879.3104 884.1025 926.1224 936.0964 957.7724 979.2655 992.2876 993.2471 996.8108 1003.7017 1013.5058 1030.8186 1040.1197 1080.1925 1093.5473 1107.6157 1139.7648 1149.0641 1160.0850 1169.6669 1170.7763 1177.8444 1185.2385 1212.0190 1243.9072 1266.3407 1285.9946 1291.3970 1312.8221 1344.6192 1370.3130 1384.9561 1388.7693 1396.4681 1410.2968 1414.0405 1442.9814 1451.3327 1452.7234 1452.8930 1469.9947 1477.3232 1519.6340 1536.1632 1550.7300 1572.1768 1592.1829 1592.6906 1608.6321 1610.9646 1631.1345 1662.8100 3009.2255 3097.0567 3133.1448 3133.4082 3146.0023 3150.1302 3158.0592 3163.1833 3163.7769 3171.4313 3182.9971 3212.6713 3293.7581 3526.9991 3623.7322
redmass: 6.0590 7.8047 5.1881 7.5181 3.2123 1.9467 3.1117 2.8081 5.3412 6.4224 6.7168 5.5775 6.9903 7.5146 6.0850 5.7538 4.8554 7.7026 6.6138 4.8471 6.7269 4.8486 1.1900 7.7289 6.0276 6.5435 7.8714 3.1347 3.5628 7.1435 6.0772 6.7300 4.9550 7.1329 3.4659 3.8222 4.8675 3.1593 1.2154 5.7544 6.2035 5.2735 6.4986 6.5629 5.8250 5.7564 4.5874 6.3912 4.3622 3.6397 3.5004 5.6822 1.9357 1.1272 1.4492 4.0898 1.5446 1.5306 2.6502 7.6101 7.0333 5.4399 2.0215 1.3450 1.3211 2.7370 2.5762 1.3893 2.6633 1.3591 2.1010 1.6405 3.4854 2.4958 1.2692 1.8528 2.5186 1.5250 1.5370 1.2074 2.7440 1.9112 3.8527 1.7714 2.3821 3.6809 1.2969 3.8613 3.8842 7.1651 1.2471 8.4742 7.6761 3.5630 3.4807 2.8074 1.0618 4.0752 1.0465 2.6914 2.4609 8.5417 4.9882 2.1644 4.9966 6.8995 5.7892 6.4682 6.7038 7.8555 9.7181 1.0369 1.0973 1.0862 1.0913 1.1011 1.0905 1.0918 1.0944 1.0888 1.0994 1.0978 1.0946 1.0607 1.0657 1.0906
irintensity: 0.2327 1.6827 0.3683 7.0508 1.6596 0.5129 0.5448 1.1494 2.2207 1.4901 1.2120 1.9067 2.5023 1.8922 1.7267 2.4215 3.7612 8.0301 2.6255 2.3714 4.8133 6.0896 83.7937 4.9858 9.8561 6.3942 39.0915 0.8135 0.6209 3.1244 18.0949 5.4895 11.5804 5.3663 2.8973 15.9500 12.5359 0.7163 151.1823 5.9193 2.2737 18.7337 6.1006 4.8267 17.7250 5.4823 2.8331 3.7631 7.4925 6.5475 25.4111 2.5934 64.0913 99.3052 14.1586 73.4363 54.1951 41.1180 0.0197 14.1486 61.2241 36.6249 0.0935 0.5493 1.0900 106.0419 50.7320 4.7285 69.3658 0.0368 25.8973 8.8821 96.8798 130.6732 20.8087 54.6992 718.2272 39.0895 484.4228 85.6982 93.5778 27.2436 58.6527 72.8393 197.0754 531.5523 6.6150 311.7081 74.1058 1.7559 71.7338 19.5976 41.8325 76.1231 13.3686 5.9767 24.8948 125.1591 19.5482 3.8940 376.0914 1.5231 674.0539 14.3296 44.5800 5.4592 12.2724 6.6401 1.6601 11.5181 178.1536 0.8466 5.6329 4.9351 4.8776 9.8917 13.2649 5.1927 3.7513 5.3594 37.7465 1.3149 6.4228 67.6747 29.8390 121.9177
temp: 298.150 k
press: 1.00000 atm
elementType: 8 8 8 8 8 8 7 6 6 6 6 6 6 6 6 6 6 6 6 6 6 6 6 6 6 6 6 6 6 1 1 1 1 1 1 1 1 1 1 1 1 1 1 1
symmnumber: 1
zpe: 838116.6 jmol-1
zpe.correction: 0.319222 hartree
zpe.thermalcorrener: 0.343883 hartree
zpe.thermalcorrenthalpy: 0.344827 hartree
zpe.thermalcorrgfe: 0.261466 hartree
zpe.sumelectzpe: -1351.457752 hartree
zpe.sumelectthermal: -1351.433090 hartree
zpe.sumelectthermalent: -1351.432146 hartree
zpe.sumelectthermalfe: -1351.515507 hartree
dipole: -6.3072 -2.1534 -1.4455
dipole: 6.8196
quadrupole: -123.1045 -173.3327 -168.2538
quadrupole: -3.2610 14.6879 0.1836
quadrupole: 31.7925 -18.4357 -13.3568 -3.2610 14.6879 0.1836
hfenergy: -1351.7769733 hartree
pointgroup: C01 [X(C22H15N1O6)]
dipole: 2.5309167 0.7614907 -0.4618024 debye
polarizability: 537.9533423|-3.2394854|261.9838476|-11.2775161|-0.8088863|145.7931717 unknown
InChI: InChI=1S/C22H15NO6/c1-11(24)28-12-6-8-13(9-7-12)29-17-10-16(25)18-19(20(17)23)22(27)15-5-3-2-4-14(15)21(18)26/h2-10,25H,23H2,1H3
charge 0 multiplicity 1
44 atoms
O  1.426691 1.504871 -0.206652
O  -0.89457 -2.786185 -0.753874
O  -3.450491 2.661425 0.492432
O  -3.524475 -2.784334 -0.491036
O  6.760654 -0.284809 0.154782
O  6.78242 -1.759433 1.994875
N  -0.875552 2.747482 0.277553
C  -2.174263 0.658778 0.010471
C  -2.178919 -0.768952 -0.250942
C  -4.708886 0.635467 0.234359
C  -4.723375 -0.762626 -0.019421
C  -3.430024 1.388219 0.257798
C  -0.94217 1.399394 0.037178
C  -3.459361 -1.530634 -0.27193
C  -0.935615 -1.415973 -0.488622
C  0.281371 0.682345 -0.204087
C  0.287243 -0.683405 -0.464467
C  -5.926647 1.325301 0.469032
C  -5.959041 -1.45718 -0.036456
C  -7.14879 0.628409 0.450357
C  -7.164773 -0.768641 0.196454
C  2.732505 0.947098 -0.092034
C  3.085104 0.097849 0.977999
C  3.692279 1.372056 -1.033984
C  4.416547 -0.353977 1.111198
C  5.023001 0.930814 -0.903229
C  5.378057 0.069157 0.160159
C  7.377168 -1.175788 1.06809
C  8.843196 -1.289431 0.720292
H  1.236863 -1.194991 -0.660865
H  -5.879979 2.40131 0.661731
H  -5.937939 -2.533258 -0.234985
H  -8.087925 1.162375 0.631479
H  -8.116764 -1.310515 0.181881
H  0.032853 3.207161 0.276921
H  -1.777646 3.223427 0.444252
H  0.042827 -3.078737 -0.897722
H  2.333656 -0.201378 1.715479
H  3.392872 2.039461 -1.846662
H  4.700145 -1.009237 1.934645
H  5.793981 1.241405 -1.613857
H  8.96066 -1.698991 -0.298163
H  9.342771 -1.948211 1.444575
H  9.316541 -0.292719 0.728995
