program: Gaussian 09
title: 000088084
version: EM64L-G09RevD.01
frameworkgroup: C1[X(C11H28N4)]
method: RPBEPBE
basis: SDD
operation: Freq
keyword: #pfreq=noraman
keyword: PBEPBE/SDD
title: #p freq=noraman PBEPBE/SDD
converged: YES YES NO NO
title: Mulliken charges:
elementType: N N N N C C C C C C C C C C C H H H H H H H H H H H H H H H H H H H H H H H H H H H H
charge: -0.272895 -0.274783 -0.077816 -0.570786 -0.413119 -0.354555 -0.413189 -0.357505 -0.353462 -0.330334 -0.349922 -0.378899 -0.368649 -0.614994 -0.625478 0.242892 0.166801 0.169598 0.205572 0.187945 0.238112 0.206224 0.169352 0.168832 0.204885 0.204810 0.167245 0.233661 0.205073 0.167803 0.234183 0.166998 0.243576 0.172418 0.204636 0.225154 0.183722 0.221116 0.234892 0.219240 0.181619 0.271725 0.258301
chargesum: 0.00000
title: Mulliken charges with hydrogens summed into heavy atoms:
elementType: N N N N C C C C C C C C C C C
charge: -0.039234 -0.040600 -0.077816 -0.040759 -0.003426 0.020614 0.012867 0.018071 0.020255 0.041721 0.022955 0.031675 0.008406 0.014998 0.010273
polarizability: 2.06768097e+02 -7.04911954e-01 1.34881430e+02 4.37188533e-01 3.22386880e-01 1.18179979e+02
1716.lowfreq: -19.6282 -2.3262 -0.0007 0.0006 0.0012 10.6230 19.6478 25.4901 34.7746
frequency: -14.9299 23.7857 29.5122 41.3255 62.1669 69.3548 78.1581 91.1244 110.2863 129.3231 134.0411 144.6498 151.7191 154.7269 165.7003 207.3527 231.7623 233.0886 251.7058 295.1062 305.2909 334.8996 378.6590 410.9735 462.4089 468.5608 516.3665 522.8996 595.2351 660.1760 676.8554 767.3684 768.4163 772.5069 812.7010 864.0206 873.3184 886.3059 951.8852 995.7492 1009.7799 1026.3006 1033.9472 1049.5022 1050.9276 1072.6514 1078.8225 1082.3766 1086.4035 1094.3821 1101.9859 1104.4565 1115.9942 1129.0535 1143.4502 1150.4166 1155.7560 1202.7777 1213.0388 1219.9503 1222.0373 1251.4445 1255.5985 1265.5812 1274.7422 1277.3267 1279.2748 1284.8963 1294.4638 1296.8595 1303.9697 1341.2896 1356.4536 1377.4739 1386.5654 1392.4679 1398.8852 1418.4188 1441.8041 1450.7088 1454.6578 1461.1460 1462.4811 1467.3465 1471.2464 1474.1621 1475.5732 1479.2335 1484.6599 1486.4957 1489.8808 1494.2505 1499.1242 1502.7512 1637.5217 2808.4484 2824.6906 2828.6652 2833.5606 2835.2456 2841.2194 2853.1515 2861.0080 2949.3706 2950.9094 2974.7619 2990.0498 2991.1236 2991.5670 2997.6969 3005.9849 3008.8728 3016.8150 3028.8519 3062.1849 3063.7554 3065.7036 3076.2578 3086.9287 3417.3438 3418.6347 3452.9097 3581.0065
redmass: 2.4186 4.2283 2.4282 3.9467 1.7877 3.8495 3.2035 1.8309 2.8092 2.2948 2.2968 2.6289 2.0948 3.8671 2.5141 2.3615 1.1886 1.2272 1.1691 3.0940 3.1468 2.3360 3.0773 2.8278 2.7792 3.0837 2.9318 3.0743 1.2840 1.3430 1.2962 1.0919 1.0881 1.0882 4.2012 1.1845 1.2133 1.2533 2.1983 3.2232 2.8771 2.6649 1.6007 2.7921 2.7855 2.3285 2.0059 1.7682 2.0057 1.4470 2.3156 1.7774 1.7687 1.2411 4.0474 1.6252 4.2564 1.8832 1.6590 1.6110 1.3285 1.3302 1.3543 2.0245 1.0966 1.0812 1.1183 1.1638 1.2153 1.3186 1.3775 1.3207 1.4263 1.4125 1.4296 1.4907 1.5651 1.1455 1.1729 1.2081 1.2119 1.0677 1.0488 1.0735 1.0725 1.0647 1.0698 1.0677 1.0830 1.0680 1.0880 1.0911 1.0860 1.0849 1.0941 1.0705 1.0720 1.0717 1.0712 1.0578 1.0712 1.0580 1.0716 1.0688 1.0692 1.0685 1.0868 1.0842 1.0846 1.0830 1.0829 1.0855 1.0713 1.0711 1.0951 1.0990 1.0953 1.1010 1.1000 1.0739 1.0740 1.0448 1.0975
irintensity: 3.5631 0.1005 0.8891 0.1406 0.0841 0.0315 0.1413 0.1454 0.0999 0.7207 0.2254 1.8698 5.1787 0.9852 2.7416 10.0407 33.1136 11.9605 5.2073 0.3130 8.6289 9.5597 5.9232 4.8883 14.0116 18.4571 11.8604 6.4545 198.1113 10.9963 178.9198 1.5872 1.0894 10.9434 23.2514 3.8185 0.1661 0.7850 0.4036 3.9382 0.1150 54.3775 8.6479 5.5605 5.7658 7.9062 4.4148 3.0241 0.6285 5.2547 6.9046 6.3210 6.8947 66.4138 87.8669 12.9139 0.2974 2.4134 1.3237 5.6261 0.6073 2.9136 1.4554 6.5986 0.8251 2.7083 4.7772 0.7471 1.2485 7.4085 0.8383 0.5198 30.1755 23.7655 28.3510 1.1684 0.0217 2.3718 4.7671 43.8865 13.1139 4.1857 19.4725 2.3333 7.2834 3.7185 10.4965 14.7180 3.7406 19.8365 2.4955 2.1032 0.2834 5.3837 40.0381 62.6884 71.8734 36.4603 4.3601 74.4708 290.2390 276.7259 188.1195 14.5358 27.1850 5.5966 1.3085 30.9155 7.6279 90.2440 62.3361 65.6411 48.1878 44.9267 28.1822 50.2111 53.3238 38.0187 46.0383 2.6742 2.5714 1.8344 0.1310
temp: 298.150 k
press: 1.00000 atm
elementType: 7 7 7 7 6 6 6 6 6 6 6 6 6 6 6 1 1 1 1 1 1 1 1 1 1 1 1 1 1 1 1 1 1 1 1 1 1 1 1 1 1 1 1
symmnumber: 1
zpe: 1025672.0 jmol-1
zpe.correction: 0.390658 hartree
zpe.thermalcorrener: 0.410481 hartree
zpe.thermalcorrenthalpy: 0.411425 hartree
zpe.thermalcorrgfe: 0.340254 hartree
zpe.sumelectzpe: -653.623497 hartree
zpe.sumelectthermal: -653.603673 hartree
zpe.sumelectthermalent: -653.602729 hartree
zpe.sumelectthermalfe: -653.673901 hartree
dipole: -0.2036 -0.5230 3.9625
dipole: 4.0020
quadrupole: -82.0153 -92.4841 -102.8332
quadrupole: 0.1754 -7.7637 5.8424
quadrupole: 10.4289 -0.0399 -10.3890 0.1754 -7.7637 5.8424
hfenergy: -654.0141546 hartree
pointgroup: C01 [X(C11H28N4)]
dipole: -0.077348 -0.0778605 1.5706961 debye
polarizability: 206.7640949|-0.9213627|134.8286057|0.3181856|-1.0371105|118.236806 unknown
InChI: InChI=1S/C11H28N4/c1-15(2)11-5-10-14-9-4-8-13-7-3-6-12/h13-14H,3-12H2,1-2H3
charge 0 multiplicity 1
43 atoms
N  1.395702 0.075581 -0.050174
N  -3.582971 0.173405 -0.079496
N  6.403555 0.225216 -0.343626
N  -8.519185 0.733309 -0.261989
C  -1.094177 0.12362 -0.069551
C  0.17077 -0.678174 0.292609
C  3.879258 0.224302 -0.153826
C  2.660352 -0.636477 0.232458
C  -2.393481 -0.616094 0.3038
C  5.208881 -0.484039 0.17656
C  -4.879363 -0.453565 0.256073
C  -6.055777 0.436471 -0.188481
C  -7.428841 -0.157566 0.185308
C  7.615284 -0.615721 -0.257077
C  6.61613 1.546566 0.280316
H  -1.093404 0.3416 -1.152393
H  -1.068807 1.10367 0.456571
H  0.1305 -0.969143 1.375497
H  0.182109 -1.624197 -0.28556
H  3.816756 1.193649 0.381927
H  3.843709 0.445991 -1.235668
H  2.664755 -1.570093 -0.365926
H  2.750412 -0.947968 1.306927
H  -2.375691 -0.869134 1.396896
H  -2.435616 -1.581301 -0.240651
H  5.195883 -1.489647 -0.288745
H  5.278558 -0.64316 1.287655
H  1.390565 1.011306 0.382224
H  -4.933887 -1.426373 -0.273489
H  -4.977889 -0.682845 1.350308
H  -3.527927 1.13421 0.289888
H  -5.954397 1.438302 0.284984
H  -6.012499 0.592933 -1.280768
H  -7.440232 -0.371503 1.284063
H  -7.551776 -1.130802 -0.328916
H  7.452563 -1.560739 -0.805675
H  7.90704 -0.872665 0.794566
H  8.466843 -0.091044 -0.726543
H  5.758025 2.21003 0.080993
H  7.5132 2.018474 -0.158907
H  6.76346 1.489803 1.390878
H  -9.457846 0.330686 -0.18255
H  -8.472544 1.675726 0.13931
