program: Gaussian 09
title: 000088104
version: EM64L-G09RevD.01
frameworkgroup: C1[X(C14H19NO2)]
method: RPBEPBE
basis: SDD
operation: Freq
keyword: #p
keyword: freq=noraman
keyword: PBEPBE/SDD
title: #p freq=noraman PBEPBE/SDD
converged: YES YES NO NO
title: Mulliken charges:
elementType: O O N C C C C C C C C C C C C C C H H H H H H H H H H H H H H H H H H H
charge: -0.284305 -0.278015 -0.108134 -0.404608 -0.379600 -0.379578 -0.384036 -0.352925 0.128692 0.132599 0.252234 -0.349491 -0.366309 -0.252625 -0.230055 -0.246001 -0.684175 0.190052 0.219994 0.212219 0.200679 0.198683 0.204682 0.264747 0.206121 0.203967 0.237091 0.257345 0.245412 0.229818 0.225367 0.203321 0.215750 0.208738 0.238553 0.223794
chargesum: 0.00000
title: Mulliken charges with hydrogens summed into heavy atoms:
elementType: O O N C C C C C C C C C C C C C C
charge: -0.284305 -0.278015 -0.108134 0.005438 0.033298 0.023788 0.086831 0.088134 0.128692 0.132599 0.252234 -0.092146 -0.120897 -0.022807 -0.004689 0.173070 -0.013090
polarizability: 1.90971635e+02 1.26721913e+01 1.73874357e+02 1.41450421e+01 -2.72149796e+00 1.24871225e+02
1716.lowfreq: -13.9964 -8.6106 -1.6073 -0.0003 0.0003 0.0006 26.1623 47.5004 64.0424
frequency: 25.8760 47.4402 64.0049 66.6338 76.9019 106.9451 120.5685 167.6792 195.3611 213.5335 246.3030 257.3364 273.6554 305.2606 346.8946 357.9946 382.9658 413.4018 429.9052 451.2439 497.4192 523.1210 578.6446 593.8360 618.3839 684.0744 699.4661 754.8412 760.3314 769.3958 801.8060 821.8013 825.0583 846.7113 855.2108 877.2108 905.1301 919.6445 940.2369 948.1076 976.2687 995.7629 1033.8888 1037.6877 1047.7642 1084.1970 1089.4505 1113.4342 1120.6572 1126.1196 1134.7640 1151.7054 1166.2568 1174.7412 1214.4139 1234.8573 1248.9346 1257.6501 1262.6840 1271.7266 1282.6364 1325.5739 1335.0601 1340.4753 1345.7700 1356.2381 1360.2787 1380.3588 1398.3500 1413.7720 1434.6867 1454.6904 1460.2777 1461.0631 1462.0361 1463.7737 1470.6468 1473.5593 1480.6066 1492.4633 1552.8057 1586.7415 1603.2310 2951.1851 2955.1913 2959.3181 2965.5837 2982.2152 2987.0708 2995.8998 3014.4253 3034.5343 3044.2466 3053.5541 3083.9081 3088.8609 3092.8895 3105.6390 3131.5964 3145.3241 3160.6050 3171.6306
redmass: 3.9771 3.2665 4.7940 3.3006 3.5146 3.0381 2.3075 3.6884 3.2283 2.9573 1.3027 2.4389 3.6700 2.8889 3.4288 4.9382 1.8804 3.6243 3.4930 3.3582 3.0873 2.3968 3.7848 4.7694 4.7632 3.9605 6.5621 1.5523 3.1055 3.7590 1.4896 2.9006 1.1877 1.4296 1.4481 3.0349 3.2750 2.7478 1.3941 1.3158 1.3265 2.7424 2.7483 2.3462 2.0643 2.3295 1.5097 2.1931 1.9666 1.9808 1.4381 1.3030 1.9433 1.0999 3.3881 2.0317 1.8487 1.3333 1.1424 1.2690 1.4857 1.2492 1.3705 1.4986 1.4788 1.4675 1.6363 3.0728 1.3046 2.5747 2.5332 1.0906 1.1097 1.0559 1.0882 1.0954 1.6124 1.1079 1.2130 1.2060 8.4571 7.1958 6.3126 1.0691 1.0555 1.0697 1.0638 1.0609 1.0611 1.0363 1.1072 1.0960 1.1024 1.1029 1.0932 1.0932 1.0991 1.1012 1.0855 1.0901 1.0939 1.0998
irintensity: 1.2637 0.1954 4.2682 0.2479 1.8545 1.3011 1.7994 1.0693 1.6985 0.9308 0.7461 1.1210 2.7935 1.8117 3.8463 7.1037 1.1687 3.0767 0.2076 0.5445 11.4218 0.1196 2.1201 5.2930 10.3959 3.7796 13.5836 83.4863 8.2884 8.0158 0.1932 3.6054 1.7775 21.1494 0.1416 6.6545 26.6541 3.9897 2.7029 6.0861 0.1038 40.6683 52.0458 4.5200 16.4150 42.9557 7.1767 13.9783 27.2507 8.6507 3.9110 0.8847 2.0629 7.2340 166.8937 41.7200 60.7577 18.9532 0.1487 23.4035 57.4405 0.8473 1.7637 3.8646 2.8424 19.6397 6.1105 6.9716 33.7964 71.4870 104.3196 8.9144 1.7553 26.4897 7.1594 24.1698 45.9094 11.5148 2.8724 4.9141 260.5334 22.5107 60.4841 32.9697 47.3734 40.6374 47.0588 29.7196 35.5072 21.4562 31.2236 64.0593 38.2811 78.5821 8.2567 15.9359 33.9181 31.2316 2.3761 9.4736 23.9547 18.7957
temp: 298.150 k
press: 1.00000 atm
elementType: 8 8 7 6 6 6 6 6 6 6 6 6 6 6 6 6 6 1 1 1 1 1 1 1 1 1 1 1 1 1 1 1 1 1 1 1
symmnumber: 1
zpe: 797742.2 jmol-1
zpe.correction: 0.303844 hartree
zpe.thermalcorrener: 0.320290 hartree
zpe.thermalcorrenthalpy: 0.321234 hartree
zpe.thermalcorrgfe: 0.258838 hartree
zpe.sumelectzpe: -748.805581 hartree
zpe.sumelectthermal: -748.789135 hartree
zpe.sumelectthermalent: -748.788191 hartree
zpe.sumelectthermalfe: -748.850587 hartree
dipole: -0.4640 3.1814 -3.9816
dipole: 5.1176
quadrupole: -86.9675 -92.9144 -111.3323
quadrupole: -2.4890 1.4505 5.2508
quadrupole: 10.1039 4.1570 -14.2609 -2.4890 1.4505 5.2508
hfenergy: -749.1094252 hartree
pointgroup: C01 [X(C14H19N1O2)]
dipole: 0.0872562 -0.8117208 -1.8404913 debye
polarizability: 191.5493244|15.4168968|167.9515236|-11.8393594|14.5010976|130.2163696 unknown
InChI: InChI=1S/C14H19NO2/c1-2-17-13-9-5-4-8-12(13)14(16)15-10-6-3-7-11-15/h4-5,8-9H,2-3,6-7,10-11H2,1H3
charge 0 multiplicity 1
36 atoms
O  -0.595638 0.731566 2.365985
O  1.053209 -1.467526 -0.271116
N  -1.550159 0.06525 0.346847
C  -4.077681 0.245122 -1.113214
C  -4.019364 0.424518 0.422271
C  -2.738231 0.674861 -1.755599
C  -2.809531 -0.328496 1.018163
C  -1.545251 -0.081194 -1.121912
C  -0.485582 0.519478 1.112101
C  0.830814 0.818973 0.422916
C  1.621413 -0.183111 -0.211645
C  1.36965 2.119797 0.557134
C  2.903049 0.132382 -0.728083
C  2.640105 2.447575 0.034457
C  3.40246 1.448447 -0.609264
C  1.878314 -2.568902 -0.807361
C  1.050064 -3.843977 -0.674287
H  -4.271486 -0.822242 -1.349858
H  -4.915838 0.82661 -1.541339
H  -3.933016 1.500157 0.670991
H  -4.947563 0.049679 0.894574
H  -2.746968 0.481238 -2.845727
H  -2.591495 1.763855 -1.613767
H  -2.685754 -0.116838 2.092506
H  -2.950378 -1.42319 0.888785
H  -1.604765 -1.15984 -1.378618
H  -0.593475 0.302755 -1.519739
H  0.779363 2.869867 1.094014
H  3.514327 -0.633078 -1.214343
H  3.033141 3.463753 0.139995
H  4.39346 1.68517 -1.012618
H  2.131204 -2.361304 -1.867775
H  2.820059 -2.63745 -0.225493
H  1.619271 -4.708278 -1.062233
H  0.798749 -4.03447 0.382685
H  0.109322 -3.760558 -1.24553
