program: Gaussian 09
title: 000088061
version: EM64L-G09RevD.01
frameworkgroup: C1[X(C6H10ClNO)]
method: RPBEPBE
basis: SDD
operation: Freq
keyword: #p
keyword: freq=noraman
keyword: PBEPBE/SDD
title: #p freq=noraman PBEPBE/SDD
converged: NO NO NO NO
title: Mulliken charges:
elementType: Cl O N C C C C C C H H H H H H H H H H
charge: 0.099370 -0.236080 -0.367282 -0.391665 -0.354083 -0.393802 -0.358175 -0.464191 0.261286 0.192290 0.217408 0.204785 0.224284 0.216413 0.220565 0.222365 0.245410 0.210012 0.251091
chargesum: 0.00000
title: Mulliken charges with hydrogens summed into heavy atoms:
elementType: Cl O N C C C C C C
charge: 0.099370 -0.236080 -0.367282 0.018033 0.074986 0.043176 0.109600 -0.003089 0.261286
polarizability: 1.01239135e+02 -4.42208808e+00 8.98888919e+01 -5.30083725e+00 -1.66119348e+00 5.91246724e+01
1716.lowfreq: -0.0007 0.0020 0.0022 10.9718 16.8755 26.6603 64.8815 80.3975 189.5116
frequency: 64.7105 80.2809 189.5070 204.7885 258.8104 282.4563 339.5202 379.8467 398.1361 473.0957 520.1535 577.0918 660.3808 738.7325 820.2090 830.4651 864.5997 888.9560 941.7755 971.6782 1038.4696 1061.3890 1090.7207 1125.3165 1146.7444 1191.6634 1212.6000 1242.3842 1276.4261 1309.7939 1314.8107 1345.3602 1348.8392 1357.6950 1362.0898 1447.1051 1450.0914 1460.9573 1466.2170 1473.3496 1609.1343 2961.0187 2976.2926 2982.4112 2983.7652 2989.4348 3027.9756 3041.0719 3050.0870 3084.4709 3089.3511
redmass: 5.2755 4.7743 2.6423 4.1147 3.5866 4.0801 2.8356 2.6536 2.9674 1.5963 4.3816 3.2551 4.3324 2.8859 2.3644 1.6233 1.9602 2.6355 2.0138 1.9720 2.1249 2.4213 2.2406 2.3261 1.3665 1.6864 1.3213 1.3797 1.1918 1.2907 1.5973 1.3820 1.5026 1.4421 1.4421 1.0801 1.0877 1.0853 1.0902 1.0947 9.8599 1.0637 1.0691 1.0625 1.0617 1.0648 1.0956 1.1021 1.1016 1.0968 1.0938
irintensity: 0.1300 0.4567 1.5286 3.2352 2.4613 1.9059 0.5500 6.4756 5.0713 1.2190 16.8743 16.1669 6.2057 9.2443 3.3845 5.7746 5.0742 10.4235 2.8233 15.8134 0.3354 4.6522 6.1639 1.1907 4.5630 19.4065 4.3379 5.2878 7.1235 1.2574 36.8515 3.7312 1.2623 0.7401 6.4518 19.3890 2.7261 6.5570 11.1142 29.6438 275.5209 29.4322 26.6343 25.0002 31.6114 20.0001 49.9914 17.2118 68.6054 13.5689 5.0769
temp: 298.150 k
press: 1.00000 atm
elementType: 17 8 7 6 6 6 6 6 6 1 1 1 1 1 1 1 1 1 1
symmnumber: 1
zpe: 406743.7 jmol-1
zpe.correction: 0.154920 hartree
zpe.thermalcorrener: 0.163874 hartree
zpe.thermalcorrenthalpy: 0.164818 hartree
zpe.thermalcorrgfe: 0.120411 hartree
zpe.sumelectzpe: -823.929307 hartree
zpe.sumelectthermal: -823.920354 hartree
zpe.sumelectthermalent: -823.919410 hartree
zpe.sumelectthermalfe: -823.963817 hartree
dipole: -4.2058 -3.3583 1.1966
dipole: 5.5135
quadrupole: -61.8604 -64.0797 -59.5499
quadrupole: -5.6707 0.3108 0.8515
quadrupole: -0.0304 -2.2497 2.2801 -5.6707 0.3108 0.8515
hfenergy: -824.0842278 hartree
pointgroup: C01 [X(C6H10Cl1N1O1)]
dipole: 1.9315883 -0.843186 -0.5131777 debye
dipolederiv: -0.428399 -0.3500538 0.0948926 -0.2200829 -0.2796786 0.0426537 0.1618638 0.1333051 -0.0262307 -0.6939857 0.5096494 0.0863607 0.2174258 -0.7807302 -0.068588 0.1479637 -0.2081612 -0.3609474 0.23801 0.4634539 -0.2180474 0.6610655 -0.5994723 -0.1870512 -0.2460893 -0.2218209 -0.2527125 0.0855569 0.0083796 -0.0389234 -0.0002277 0.0441596 -0.0005732 -0.0511252 -0.0007544 0.1473845 0.0137498 0.0117783 -0.0212411 0.0312499 0.0370714 -0.0067143 -0.0093886 -0.0197028 0.0451364 0.1155579 -0.0063695 0.0091832 -0.0456126 0.0290025 0.0053713 0.0535093 0.0329644 0.1116035 0.3836289 -0.1454668 -0.0063737 -0.3098167 0.1836433 0.0310035 0.0032574 0.0238328 0.3001241 -0.0539348 0.0918282 0.0021087 -0.0465052 0.0036137 0.048852 -0.0209461 -0.0136896 0.124306 0.5097176 -0.5553385 -0.1013349 -0.2931993 1.3736491 0.151495 -0.1510513 0.2799738 0.1853404 0.0469162 -0.0063404 0.0566856 -0.009534 0.0107217 0.00266 0.1311884 -0.0049984 -0.1591838 -0.1255983 0.0177694 -0.1175892 0.0216755 0.0432978 0.0137828 -0.1553194 0.0161055 -0.0047446 -0.0425031 0.1262412 0.0159701 0.1013034 -0.1269191 -0.0363128 0.0082722 -0.0588029 0.075835 0.0316461 -0.0523867 0.0641228 -0.0371941 0.0727449 -0.0043153 0.0389209 0.0378458 -0.1188224 -0.1018394 -0.1363407 -0.0054398 -0.1023933 -0.0840978 0.0059513 -0.0048832 0.0229894 0.0805281 0.0366522 0.0504808 0.0689497 0.0360737 0.0666938 0.0153361 0.0295552 -0.0228231 -0.1309754 -0.0456521 0.0703716 0.0840366 0.036896 0.0553153 0.0980685 0.0327414 0.0208946 -0.1148606 0.0134726 -0.0932617 -0.0255139 -0.0406353 -0.0374614 -0.0354982 -0.0136697 0.0083333 0.1161469 0.0150863 -0.0326837 0.0544013 -0.0155607 0.0793514 -0.1037824 0.0402367 -0.024349 -0.1145397 0.001918 0.0282894 -0.0022478 0.015072 -0.0909052 0.0276613 0.0049637 -0.0011423 0.0966121 unknown
polarizability: 97.8374009|6.605442|92.9388607|-6.7437804|-0.4860546|59.476438 unknown
InChI: InChI=1S/C6H10ClNO/c7-8-5-3-1-2-4-6(8)9/h1-5H2
charge 0 multiplicity 1
19 atoms
Cl -2.44435 -1.392467 0.340637
O  -1.885856 1.5265 0.273192
N  -0.899858 -0.542595 -0.214767
C  2.31726 -0.195131 0.157885
C  1.41327 -1.440466 0.302826
C  1.624518 1.162264 0.425429
C  0.1954 -1.441545 -0.649904
C  0.441048 1.488973 -0.528018
C  -0.899571 0.843977 -0.118527
H  2.737111 -0.18068 -0.870475
H  3.179467 -0.296652 0.845339
H  2.015864 -2.343477 0.079213
H  1.048308 -1.544281 1.342831
H  2.379528 1.964092 0.310534
H  1.270527 1.213554 1.473878
H  0.506623 -1.155061 -1.675799
H  -0.239255 -2.451596 -0.714744
H  0.709913 1.209214 -1.566239
H  0.233653 2.571777 -0.515692
