program: Gaussian 09
title: 000088263
version: EM64L-G09RevD.01
frameworkgroup: C1[X(C22H22N2O2S)]
method: RPBEPBE
basis: SDD
operation: Freq
keyword: #p
keyword: freq=noraman
keyword: PBEPBE/SDD
title: #p freq=noraman PBEPBE/SDD
converged: YES YES NO NO
title: Mulliken charges:
elementType: S O O N N C C C C C C C C C C C C C C C C C C C C C C H H H H H H H H H H H H H H H H H H H H H H
charge: 0.988838 -0.500362 -0.542230 -0.008000 -0.476187 0.192538 -0.653626 -0.689825 0.490619 0.515083 -0.081937 -0.439713 -0.446809 -0.375437 -0.388536 -0.250083 -0.217191 0.448530 -0.394885 -0.341856 -0.221656 -0.220073 -0.225625 -0.225624 -0.250489 -0.244674 -0.802579 0.223525 0.247451 0.219618 0.245185 0.286117 0.235784 0.230736 0.251148 0.281305 0.286558 0.288148 0.245829 0.245789 0.227470 0.226323 0.222208 0.230824 0.229439 0.229974 0.240356 0.228613 0.239390
chargesum: 0.00000
title: Mulliken charges with hydrogens summed into heavy atoms:
elementType: S O O N N C C C C C C C C C C C C C C C C C C C C C C
charge: 0.988838 -0.500362 -0.542230 -0.008000 -0.190070 0.192538 -0.182650 -0.225022 0.490619 0.515083 -0.081937 -0.203929 -0.216072 -0.124289 -0.107231 0.036474 0.070956 0.448530 -0.149056 -0.096066 0.005813 0.006250 -0.003417 0.005200 -0.021050 -0.014700 -0.094220
polarizability: 3.48796859e+02 9.24182877e+00 3.14877617e+02 1.86236380e+01 1.51572500e+01 1.95551976e+02
1716.lowfreq: -8.0572 -5.2177 -0.0025 -0.0022 -0.0019 3.6261 7.6133 12.0168 15.1987
frequency: 5.1768 10.8324 14.8546 19.6333 29.3031 29.4147 34.1358 38.2407 46.8141 73.1000 89.1384 96.7599 127.4748 146.1063 166.1758 189.6739 200.0529 224.8665 233.7299 269.8842 292.8488 308.7046 315.9670 336.6743 376.4078 382.0449 398.7259 404.6702 405.2898 406.1209 410.6725 455.2752 463.7874 466.4125 492.0173 505.7701 564.1522 573.5186 583.3335 615.6822 617.0175 621.0430 664.8844 705.3175 706.7162 709.0781 716.3866 751.1116 765.2706 776.1513 794.7287 817.3556 822.7005 823.7322 841.6399 847.0532 856.4427 860.5308 906.1167 910.4245 926.9128 944.3774 960.8634 970.9481 978.8786 980.6777 982.2219 987.7352 989.3803 990.0920 995.9852 996.1289 1001.2126 1020.0443 1026.2616 1027.9930 1049.4416 1051.0434 1080.4388 1086.8846 1118.5860 1132.3758 1171.2675 1172.7628 1184.6492 1186.9431 1191.2143 1194.3628 1200.7531 1201.5899 1217.9590 1262.1295 1273.3963 1284.3771 1297.3416 1304.1869 1332.0489 1338.8386 1380.6858 1381.0809 1382.0215 1390.8753 1400.5308 1438.6014 1440.8944 1455.3885 1468.8632 1469.9507 1471.8132 1475.3925 1482.1352 1484.2507 1583.7908 1592.5134 1592.8570 1594.6595 1595.0791 1611.0599 1613.1803 2955.9818 2981.4924 2994.3803 3046.4674 3061.3192 3062.4619 3091.9091 3115.8408 3116.5658 3118.5706 3122.6778 3133.5254 3134.1402 3135.9125 3137.3689 3142.6834 3145.8675 3158.6828 3161.6951 3163.7303 3171.7828 3215.8558
redmass: 4.0729 5.1701 3.4997 5.2453 1.1559 4.0371 4.4012 5.0429 4.7528 6.0331 5.4957 4.6184 6.3512 6.3426 5.4768 4.9064 8.0270 6.9075 4.6839 4.9495 5.0376 3.7878 3.6008 5.1648 3.5913 2.4063 3.8153 2.8509 2.8772 2.9413 4.6807 4.8676 3.7416 3.6642 3.9125 3.1643 2.8870 4.4175 5.7557 6.2560 6.0179 6.9540 4.2309 2.6384 2.5768 1.8218 2.2230 1.7512 2.2103 4.7932 3.3690 8.1379 1.9267 2.1853 2.5449 1.2437 1.2474 1.2574 1.8615 1.6609 1.5125 2.0354 1.3200 3.9416 1.3869 1.4504 1.3883 2.2188 5.8307 5.8270 1.8064 1.7643 1.3209 2.7050 2.2403 2.2708 1.6026 2.4139 1.6073 1.6260 1.2926 1.3811 1.0557 1.0566 1.1385 1.1267 1.1864 1.4420 2.0050 2.4775 3.0248 1.5148 1.3680 1.4639 1.2629 1.8071 1.3076 1.3412 4.7555 7.8643 7.4640 2.9972 1.3053 2.1004 2.1479 1.1307 1.0485 1.1679 2.3490 1.1090 2.1845 2.0055 7.9923 6.0490 6.6200 6.1929 6.0406 6.0290 6.0935 1.0669 1.0378 1.0609 1.0934 1.0970 1.1002 1.0992 1.0866 1.0864 1.0873 1.0882 1.0915 1.0915 1.0891 1.0896 1.0961 1.0959 1.0963 1.1014 1.1015 1.0959 1.0737
irintensity: 1.1257 0.2904 0.4268 0.7513 0.3826 0.1119 0.1612 0.0816 0.3304 1.0399 0.2211 0.8796 1.1308 0.5962 0.5033 1.6030 6.7735 12.4897 2.8404 7.9679 6.3666 3.3911 8.8395 6.2350 5.4641 2.9698 17.4393 0.4843 0.5810 2.1095 25.6714 30.0361 22.3585 2.6576 71.9985 97.6859 12.4584 4.8437 32.5076 0.3169 0.2203 0.3101 10.7755 7.4978 3.4245 84.9068 42.3461 78.9975 24.7646 5.4439 0.6914 174.0005 3.2483 17.9983 6.1174 1.2287 1.2681 1.3570 1.7236 4.9685 1.8587 13.0438 1.2790 56.6517 0.0719 2.5721 0.2738 7.9170 0.7168 0.4754 2.3364 4.5989 0.5295 4.2735 8.2391 11.9367 15.1505 23.0973 4.8274 21.3685 6.9999 3.4047 0.1315 0.0839 10.8148 0.6654 0.4987 3.6841 0.3970 1.0044 5.2232 10.7605 1.0548 5.4765 2.2525 20.5909 0.9133 15.8411 4.1197 0.3036 1.0830 11.7577 15.8776 8.3713 7.3248 24.2199 14.3913 11.6334 19.7672 16.2627 22.6429 26.3648 40.0725 0.1297 5.2734 6.2123 8.4962 13.6235 2.2454 23.3207 21.2422 20.8000 12.2273 18.3824 9.1852 15.2932 17.6323 0.3646 0.1260 0.0466 11.7432 6.7662 12.6742 5.0460 36.6514 30.3301 5.6024 27.2015 31.2859 4.3280 4.2105
temp: 298.150 k
press: 1.00000 atm
elementType: 16 8 8 7 7 6 6 6 6 6 6 6 6 6 6 6 6 6 6 6 6 6 6 6 6 6 6 1 1 1 1 1 1 1 1 1 1 1 1 1 1 1 1 1 1 1 1 1 1
symmnumber: 1
zpe: 1005485.1 jmol-1
zpe.correction: 0.382969 hartree
zpe.thermalcorrener: 0.409267 hartree
zpe.thermalcorrenthalpy: 0.410211 hartree
zpe.thermalcorrgfe: 0.318446 hartree
zpe.sumelectzpe: -1507.420518 hartree
zpe.sumelectthermal: -1507.394220 hartree
zpe.sumelectthermalent: -1507.393276 hartree
zpe.sumelectthermalfe: -1507.485041 hartree
dipole: 1.2460 7.5348 0.5949
dipole: 7.6603
quadrupole: -135.7830 -186.3374 -167.2654
quadrupole: 9.9373 1.1093 3.5274
quadrupole: 27.3456 -23.2088 -4.1368 9.9373 1.1093 3.5274
hfenergy: -1507.8034867 hartree
pointgroup: C01 [X(C22H22N2O2S1)]
dipole: -0.8604615 2.8743405 -0.2841114 debye
polarizability: 350.6471113|-4.3685178|312.6112374|20.16981|-14.7857158|195.9681036 unknown
InChI: InChI=1S/C22H22N2O2S/c1-18-12-14-22(15-13-18)27(25,26)24-23-21(16-19-8-4-2-5-9-19)17-20-10-6-3-7-11-20/h2-15,24H,16-17H2,1H3
charge 0 multiplicity 1
49 atoms
S  -0.971782 -3.313396 -0.230411
O  -0.822855 -4.161198 1.13647
O  -0.994536 -4.009606 -1.703621
N  0.389574 -0.994526 0.401331
N  0.574346 -2.133986 -0.358378
C  1.052605 0.118376 0.155413
C  0.795272 1.284234 1.095409
C  2.068556 0.309457 -0.966148
C  0.03288 2.423619 0.413353
C  3.503597 0.019651 -0.510448
C  -2.456935 -2.165054 -0.058037
C  0.593318 3.720856 0.308034
C  4.505799 1.015307 -0.621074
C  -1.26003 2.192753 -0.126414
C  3.848428 -1.248007 0.029522
C  -3.13375 -1.781152 -1.225554
C  -2.832755 -1.751123 1.230971
C  -4.666593 -0.46545 0.19235
C  -4.250057 -0.925135 -1.084543
C  -3.948428 -0.895186 1.342341
C  -0.120558 4.768849 -0.319389
C  5.832604 0.751936 -0.20787
C  -1.974707 3.236858 -0.753198
C  5.173426 -1.51029 0.441251
C  -1.40719 4.529774 -0.853046
C  6.170528 -0.513041 0.32371
C  -5.855305 0.466585 0.336417
H  1.763301 1.662425 1.476815
H  0.221146 0.899149 1.956933
H  1.818367 -0.336613 -1.833682
H  1.996007 1.352401 -1.322686
H  0.73003 -2.038888 -1.388812
H  1.589805 3.913274 0.725295
H  4.249422 1.997868 -1.036889
H  -1.702346 1.191534 -0.051085
H  3.080825 -2.025163 0.129337
H  -2.816262 -2.15891 -2.203201
H  -2.278189 -2.096549 2.108246
H  -4.805067 -0.617539 -1.977892
H  -4.264659 -0.553289 2.334648
H  0.325831 5.767268 -0.390344
H  6.598022 1.530699 -0.301735
H  -2.97264 3.043676 -1.164315
H  5.427495 -2.492818 0.854567
H  -1.961379 5.340011 -1.340004
H  7.197879 -0.720216 0.643402
H  -5.538994 1.456529 0.716558
H  -6.369863 0.62383 -0.626376
H  -6.593684 0.065819 1.05468
