program: Gaussian 09
title: 000088015
version: EM64L-G09RevD.01
frameworkgroup: C1[X(C5H11NS)]
method: RPBEPBE
basis: SDD
operation: Freq
keyword: #p
keyword: freq=noraman
keyword: PBEPBE/SDD
title: #p freq=noraman PBEPBE/SDD
converged: YES YES NO NO
title: Mulliken charges:
elementType: S N C C C C C H H H H H H H H H H H
charge: 0.156393 -0.302917 -0.095663 -0.352155 -0.641868 -0.650550 -0.647091 0.198033 0.229651 0.263724 0.269328 0.246175 0.214006 0.195813 0.254230 0.233945 0.197775 0.231170
chargesum: 0.00000
title: Mulliken charges with hydrogens summed into heavy atoms:
elementType: S N C C C C C
charge: 0.156393 -0.039192 -0.095663 0.075529 -0.126365 0.013500 0.015799
polarizability: 9.08030130e+01 -3.80782842e-01 7.51918922e+01 -5.84937337e-01 -1.39228611e+00 6.25179067e+01
1716.lowfreq: -0.0035 -0.0034 -0.0014 11.6746 21.0346 28.9278 95.7704 205.2112 236.3703
frequency: 95.4992 205.2085 236.3623 258.5000 277.1640 314.1714 352.3053 388.7594 465.4600 483.8945 523.6532 609.4751 657.7404 832.7158 889.7879 913.1170 931.9674 961.4681 989.0110 1017.1543 1101.0346 1116.7009 1148.6634 1175.9763 1193.7357 1222.6293 1272.7165 1326.7361 1373.7799 1385.1719 1400.6943 1443.9369 1449.7346 1455.9774 1468.6496 1471.5910 1483.9787 2890.7859 2965.3846 2973.9427 3029.4496 3046.2919 3062.0925 3069.8698 3091.2487 3116.6801 3122.3621 3455.1683
redmass: 2.8479 1.1422 1.8981 1.0867 2.2029 2.7317 2.7288 1.5831 3.8572 2.6802 4.1287 3.9118 3.1195 1.9812 1.8395 1.7412 1.8352 1.9795 1.2843 1.3596 2.3891 1.7028 1.3462 2.4998 1.5514 3.0740 1.2327 1.3205 1.2158 1.2661 1.2771 1.0980 1.0501 1.0534 1.0546 1.0598 1.0755 1.0698 1.0390 1.0399 1.0826 1.0638 1.0948 1.0945 1.0996 1.0995 1.1101 1.0750
irintensity: 1.5259 2.6471 4.1834 0.9535 5.8683 4.3735 0.6442 71.6186 1.4444 64.3983 6.9081 13.6915 6.7073 4.2198 10.0356 1.1651 3.1557 3.7388 1.0610 1.2620 14.8929 22.1825 11.2696 29.3497 9.9980 36.4616 17.7590 26.4199 26.5999 30.0753 2.7912 4.6109 1.1665 5.8020 7.3979 12.2602 5.4659 103.9083 24.7436 47.4499 17.1274 57.0142 8.8733 42.3947 24.1760 17.6973 20.7466 0.3220
temp: 298.150 k
press: 1.00000 atm
elementType: 16 7 6 6 6 6 6 1 1 1 1 1 1 1 1 1 1 1
symmnumber: 1
zpe: 405046.0 jmol-1
zpe.correction: 0.154274 hartree
zpe.thermalcorrener: 0.162435 hartree
zpe.thermalcorrenthalpy: 0.163379 hartree
zpe.thermalcorrgfe: 0.122278 hartree
zpe.sumelectzpe: -649.350961 hartree
zpe.sumelectthermal: -649.342799 hartree
zpe.sumelectthermalent: -649.341855 hartree
zpe.sumelectthermalfe: -649.382956 hartree
dipole: -0.0505 2.4565 0.4897
dipole: 2.5054
quadrupole: -46.1735 -51.5196 -54.1239
quadrupole: 0.5105 -0.0217 0.6790
quadrupole: 4.4321 -0.9139 -3.5183 0.5105 -0.0217 0.6790
hfenergy: -649.5052347 hartree
pointgroup: C01 [X(C5H11N1S1)]
dipole: 0.0536904 0.9744178 0.138606 debye
dipolederiv: -0.369967 0.0841386 0.0058061 0.1246389 -0.2209447 -0.023917 -0.0046484 -0.0208711 -0.2007017 -0.6523312 -0.0475693 -0.0382798 -0.0855592 -0.3339983 0.0169831 0.0160282 0.0599499 -0.7188124 0.6692835 -0.0774443 -0.0584364 -0.0848756 0.5063195 0.0350463 -0.0379415 0.0253247 0.4603787 0.3339766 -0.0178699 0.1128998 -0.0758066 0.1247983 -0.002476 0.1192684 0.0976299 0.397185 0.2987623 0.0676318 -0.0374982 0.1555277 -0.0521984 -0.0276022 -0.0948411 -0.0333928 0.1447441 -0.0737164 -0.0564664 -0.0396808 0.0225949 0.0175643 -0.0351788 -0.0603922 -0.0730064 -0.0875848 -0.0813602 -0.0293761 0.0632964 0.0085716 -0.0312523 -0.0873023 0.0654222 0.0106484 -0.1868988 -0.0201932 0.0138271 -0.0130384 0.0148466 0.0160127 -0.0508145 -0.1265785 -0.1269112 -0.252955 -0.0380505 -0.0962299 0.0438585 -0.1461089 -0.0456646 0.0572229 0.0707092 0.0865272 0.0343393 0.0845877 0.0725817 -0.0256902 0.0642513 -0.009133 0.0313364 0.0114612 -0.0907048 0.3527814 -0.0252454 -0.0149186 0.0742974 -0.0504995 0.0309252 -0.0057448 0.1301377 -0.0441019 -0.0932196 -0.1039083 0.0375031 -0.0809334 -0.0059662 0.0711925 0.0268428 -0.102417 0.0360181 0.0114973 -0.0106744 -0.0895988 0.0183816 -0.1302195 -0.0162205 0.0438914 0.0598702 0.0825782 0.054729 -0.0378668 0.106017 -0.059125 0.1495359 -0.0882856 0.0499474 -0.0677509 0.0170305 0.0707009 0.0694219 0.0353412 0.0908908 0.014304 0.0828562 -0.0578495 0.0484518 -0.0550408 -0.0711062 -0.0125952 -0.0572594 -0.1380772 -0.0376026 0.0622732 -0.0604416 -0.0881684 -0.0520446 -0.0148369 -0.045651 0.1441062 0.0136073 0.1719087 -0.0823428 0.0072135 -0.0093557 0.0366709 0.0525454 0.0155274 -0.074414 0.0677216 -0.1095415 -0.0319018 0.0828427 0.0707447 0.043696 0.0472145 unknown
polarizability: 90.6575726|-1.5994881|75.1558924|0.0329101|-2.0996511|62.6993469 unknown
InChI: InChI=1S/C5H11NS/c1-5(2)6-3-4-7-5/h6H,3-4H2,1-2H3
charge 0 multiplicity 1
18 atoms
S  0.369267 -1.539144 0.325454
N  0.183835 0.986895 -0.579396
C  -0.771146 0.001208 -0.012734
C  1.511054 0.925731 0.065252
C  1.943221 -0.546924 -0.059217
C  -1.84216 -0.362161 -1.053889
C  -1.400207 0.435845 1.335101
H  1.510418 1.218021 1.142906
H  2.212515 1.590982 -0.471284
H  -0.21788 1.930164 -0.663869
H  2.267458 -0.784608 -1.083676
H  2.719024 -0.8237 0.671941
H  -2.509196 -1.158663 -0.678952
H  -2.467856 0.52376 -1.283552
H  -1.360832 -0.705008 -1.982909
H  -0.622142 0.743836 2.054924
H  -2.094618 1.285462 1.173613
H  -1.972256 -0.390398 1.793186
