program: Gaussian 09
title: 000087999
version: EM64L-G09RevD.01
frameworkgroup: C1[X(C9H10O4)]
method: RPBEPBE
basis: SDD
operation: Freq
keyword: #pfreq=noraman
keyword: PBEPBE/SDD
title: #p freq=noraman PBEPBE/SDD
converged: YES YES NO NO
title: Mulliken charges:
elementType: O O O O C C C C C C C C C H H H H H H H H H H
charge: -0.334206 -0.274584 -0.370995 -0.186677 0.055117 0.287048 0.029660 0.352704 -0.359003 -0.381044 -0.202378 -0.513066 -0.532782 0.244789 0.230596 0.148318 0.265066 0.219770 0.235438 0.378663 0.233098 0.226726 0.247742
chargesum: 0.00000
title: Mulliken charges with hydrogens summed into heavy atoms:
elementType: O O O O C C C C C C C C C
charge: -0.334206 -0.274584 0.007668 -0.186677 0.055117 0.287048 0.029660 0.352704 -0.114214 -0.150449 -0.054060 0.207209 0.174784
polarizability: 1.72705612e+02 -2.19353618e+00 1.27603424e+02 -7.71646210e-01 -3.21779590e+00 5.60764122e+01
1716.lowfreq: -9.0762 -1.6344 0.0002 0.0005 0.0007 7.9348 61.6312 69.3389 104.5739
frequency: 61.5768 69.2964 104.5722 119.3768 156.0751 175.1700 181.0854 197.0142 235.0799 240.2799 292.3735 332.5888 333.1383 383.2684 407.5607 480.1871 524.9795 563.6628 610.6357 613.6175 635.1902 664.5573 746.2378 756.6764 787.5174 852.2118 928.1532 931.6188 981.5245 1019.7542 1078.1404 1113.1282 1115.1904 1146.9037 1153.2413 1188.9017 1195.1978 1226.7122 1256.8670 1299.0220 1398.4978 1405.5803 1422.9960 1437.8724 1450.9567 1457.9829 1468.6397 1472.9045 1480.8659 1490.3361 1573.9189 1611.5358 1626.9176 2819.1504 2972.5759 2983.7436 3066.3796 3096.0020 3124.8388 3132.5530 3135.9189 3173.3226 3402.4190
redmass: 3.9180 3.0300 4.0041 2.0576 2.0557 3.6064 2.3206 4.5539 4.2525 1.2371 5.0000 5.2685 3.9375 4.7481 5.6612 6.5338 5.8401 4.3463 4.7221 6.3288 1.1133 4.8711 6.1923 5.4226 1.4717 5.8201 1.3474 7.8394 1.8039 6.4320 4.0386 1.2550 1.2424 1.4144 1.3796 1.7700 1.7898 4.6270 2.0358 2.2726 2.4581 2.2252 1.3132 1.2033 1.5326 1.4544 1.0509 1.1089 1.0542 2.4660 8.4125 6.6838 6.8861 1.0821 1.0322 1.0338 1.1045 1.0986 1.0892 1.1006 1.1053 1.0934 1.0630
irintensity: 2.3785 1.6144 10.4684 5.9199 2.3548 0.8173 1.7311 1.5678 5.4957 1.0280 10.0640 4.7636 12.9041 4.0780 3.1242 5.8111 19.6013 1.9646 3.5126 14.3065 130.4474 22.0276 14.2958 9.0892 50.9930 40.1211 0.2731 21.5213 3.3768 28.8891 274.1983 0.0674 10.5647 0.3214 7.6294 14.5984 73.3654 180.7931 74.3578 77.2294 110.3423 20.1018 3.4029 15.7555 68.4309 35.4646 14.5772 53.3655 16.4621 25.6748 92.3505 391.7819 87.1852 150.3391 62.0044 66.6139 38.1119 30.7538 8.2848 16.6128 12.3347 9.4857 81.3723
temp: 298.150 k
press: 1.00000 atm
elementType: 8 8 8 8 6 6 6 6 6 6 6 6 6 1 1 1 1 1 1 1 1 1 1
symmnumber: 1
zpe: 456759.3 jmol-1
zpe.correction: 0.173970 hartree
zpe.thermalcorrener: 0.187017 hartree
zpe.thermalcorrenthalpy: 0.187962 hartree
zpe.thermalcorrgfe: 0.134590 hartree
zpe.sumelectzpe: -648.831420 hartree
zpe.sumelectthermal: -648.818373 hartree
zpe.sumelectthermalent: -648.817429 hartree
zpe.sumelectthermalfe: -648.870800 hartree
dipole: 7.5184 -2.3913 1.3296
dipole: 8.0008
quadrupole: -86.3313 -60.6920 -77.5344
quadrupole: 2.8902 1.6456 2.0694
quadrupole: -11.4788 14.1605 -2.6818 2.8902 1.6456 2.0694
hfenergy: -649.0053904 hartree
pointgroup: C01 [X(C9H10O4)]
dipole: -2.9643523 0.9174434 0.5285134 debye
dipolederiv: -0.7547274 -0.6014455 0.1064702 -0.4998033 -0.9875648 0.1377722 0.0263799 -0.0425002 -0.3517117 -1.7742816 0.3865031 -0.0614421 0.1371946 -0.4132343 0.0126299 -0.0608483 0.0345127 -0.2788655 -0.3283774 0.4421578 0.0629232 0.3598449 -1.0711045 -0.0552379 0.0426063 -0.0536449 -0.3573621 -1.1972384 0.0907733 0.0024683 0.4833245 -0.4359533 -0.0047958 0.0225733 -0.0055047 -0.3211458 -0.2248236 0.7285534 0.0812836 0.6772733 0.6370225 -0.0585743 0.115543 0.1318846 -0.0709691 1.5319779 -0.198985 0.0645233 0.1957897 0.2277031 0.0304826 0.0540188 -0.0336169 0.1105252 0.4976205 -0.6303353 -0.0440239 -0.1402735 0.8783606 0.1096396 0.0000913 0.1256663 0.0990084 -1.108634 -0.1464547 -0.0203399 -0.0543319 -0.2950917 -0.0299036 -0.0137421 -0.0282198 -0.027647 -0.5668246 -0.1061254 -0.0110389 -0.3617152 -0.1582806 -0.0036002 -0.038091 0.0001884 -0.2198427 0.5095397 0.0384713 0.0081649 -0.3077048 0.0465043 0.0307147 -0.0098792 0.022838 -0.143349 1.8933912 0.0708189 0.0189912 -0.0827268 0.7342963 0.0494862 0.0246223 0.0415625 0.102271 0.50775 0.375189 -0.1248469 0.1549061 0.3521148 -0.1107817 -0.189777 -0.2306913 0.4223236 0.6472701 -0.2195617 0.01432 -0.5279711 0.4605911 -0.0187279 -0.0034237 0.0017312 0.3085003 0.0155048 0.0902026 0.0035243 0.0907069 -0.0206428 -0.0086948 0.0054731 -0.0130381 0.1741958 0.0511997 -0.1058681 -0.0101219 -0.0590982 -0.0379605 -0.0168383 -0.006631 -0.0193238 0.1526757 0.0103107 0.0001411 0.0005267 -0.1649618 -0.309325 -0.0316566 -0.0175634 -0.030357 0.0942439 -0.0701679 0.0177051 0.0266691 0.1240532 0.1070875 -0.0006644 0.0204089 0.0397561 0.0645504 -0.0050936 -0.0452701 -0.0869768 -0.0229834 0.077339 -0.0231545 0.0174819 0.104429 -0.1628246 0.0793941 -0.0432757 0.0199385 -0.0925183 -0.1420982 -0.0269362 0.0162638 -0.0476224 0.076155 0.3003093 -0.0762777 -0.0488584 -0.0955429 0.3735823 0.0081211 -0.0179209 0.0124694 0.3544981 0.0590381 -0.0368202 0.0754519 0.1255047 -0.0546473 0.1006097 0.0155065 0.1020198 -0.0566039 0.0588704 -0.0149141 -0.0595761 0.1386581 -0.0396542 -0.0816228 0.014199 -0.1070615 -0.0923024 -0.132008 -0.0151821 -0.0180303 -0.0776249 0.0709555 -0.0082667 -0.0172915 -0.0054774 0.1236763 unknown
polarizability: 172.7580022|-1.5731895|127.6823925|-0.4956485|1.1264782|55.9450537 unknown
InChI: InChI=1S/C9H10O4/c1-12-7-4-3-6(5-10)8(11)9(7)13-2/h3-5,11H,1-2H3
charge 0 multiplicity 1
23 atoms
O  -0.977395 -1.970603 -0.262531
O  -2.657893 0.332398 -0.086174
O  1.657286 -1.75646 -0.16901
O  3.957886 0.011418 0.0363
C  -0.481093 -0.659434 -0.078346
C  -1.272921 0.51553 -0.016209
C  0.939116 -0.578424 -0.064507
C  1.591352 0.686234 0.050602
C  -0.63417 1.779612 0.10497
C  0.768102 1.842675 0.136188
C  3.055585 0.887661 0.088876
C  -1.988324 -2.458489 0.705118
C  -3.504105 1.532992 -0.089478
H  -1.222971 2.698399 0.163739
H  1.260694 2.81876 0.226856
H  3.329427 1.974372 0.177411
H  -2.908598 -1.85946 0.623799
H  -1.589606 -2.411074 1.736236
H  -2.177102 -3.503625 0.417561
H  0.988047 -2.493459 -0.277122
H  -3.265083 2.182754 -0.951949
H  -3.395104 2.102034 0.853063
H  -4.532528 1.155088 -0.180693
