program: Gaussian 09
title: 000088016
version: EM64L-G09RevD.01
frameworkgroup: C1[X(C13H13NO)]
method: RPBEPBE
basis: SDD
operation: Freq
keyword: #p
keyword: freq=noraman
keyword: PBEPBE/SDD
title: #p freq=noraman PBEPBE/SDD
converged: YES YES NO NO
title: Mulliken charges:
elementType: O N C C C C C C C C C C C C C H H H H H H H H H H H H H
charge: -0.291459 -0.346081 0.406507 0.163423 0.406368 -0.578565 -0.441664 -0.380711 -0.450464 -0.246962 -0.433627 -0.277288 -0.239207 0.273606 -0.770424 0.237216 0.265939 0.231772 0.291233 0.238983 0.227411 0.236485 0.296759 0.232416 0.228254 0.254822 0.254847 0.210411
chargesum: 0.00000
title: Mulliken charges with hydrogens summed into heavy atoms:
elementType: O N C C C C C C C C C C C C C
charge: -0.291459 -0.049322 0.406507 0.163423 0.406368 -0.075410 -0.209892 -0.089479 -0.211480 -0.019551 -0.197142 -0.044872 -0.010954 0.273606 -0.050343
polarizability: 1.73940961e+02 6.53710227e+00 1.88737598e+02 -1.39791354e+01 -3.29546972e+00 8.59138249e+01
1716.lowfreq: -13.4798 -8.3039 -4.8112 -0.0002 0.0005 0.0007 43.9936 51.7020 69.8201
frequency: 43.9011 51.6229 69.8078 76.6370 136.9826 177.1241 189.3085 218.9902 284.7570 313.0097 399.3490 427.4586 457.5524 473.5117 487.4984 508.7298 546.9543 563.5962 605.5504 607.1315 613.0999 661.0098 704.7133 753.0533 785.3259 792.8697 821.6225 847.8389 873.2686 893.7729 920.6472 970.3166 976.0199 987.6282 995.2507 1005.8475 1026.1511 1040.2789 1048.1138 1076.9366 1087.3341 1151.2258 1175.6247 1184.5629 1220.4640 1239.4628 1248.8557 1258.2980 1285.3916 1346.6186 1381.7077 1386.9060 1407.0411 1421.1951 1444.9776 1449.1083 1455.0862 1465.1325 1478.3810 1489.1070 1519.0354 1589.2664 1599.3737 1609.2290 1633.7061 2995.1384 2996.5861 3061.3724 3097.2574 3101.5545 3114.8558 3119.9589 3125.9722 3130.0556 3143.2075 3155.2972 3160.9182 3552.5337
redmass: 4.4350 2.3096 2.0886 2.2190 3.5453 4.1671 5.1209 4.6659 4.0593 2.5113 3.4032 3.1121 3.0268 3.3497 4.7315 5.1733 4.9506 1.9897 3.3976 3.4830 1.6913 3.6035 4.4800 1.2805 4.7331 1.9498 1.7692 3.3228 2.7404 1.8404 1.4738 1.4423 1.6234 1.4404 2.5038 1.3261 2.8345 1.7463 2.5979 2.4954 2.6866 1.4329 1.1897 1.1829 1.2500 1.6657 1.8544 2.0432 1.6925 1.4064 2.0025 1.2331 3.1845 5.0971 2.2142 1.0552 2.4498 1.1469 1.3007 1.4661 3.5886 7.4891 5.2266 6.0498 6.3503 1.0620 1.0369 1.0987 1.0992 1.0995 1.0876 1.0864 1.0899 1.0892 1.0954 1.0990 1.1005 1.0779
irintensity: 6.8916 0.0764 5.2421 8.7498 1.4972 2.0296 2.4478 6.8907 0.9089 2.3604 1.6055 5.7318 21.4514 1.3164 2.5974 0.6178 1.3685 58.5802 10.5631 36.0955 30.2274 4.7572 6.6592 1.3400 5.3651 76.0420 67.5680 1.7099 5.3478 1.8573 0.7533 1.0640 2.0784 5.2811 2.1855 0.7831 5.9801 16.4475 0.7969 17.5510 3.1913 2.5589 4.4880 0.0982 10.4768 2.8947 2.8840 111.8897 4.2763 5.0514 28.3102 49.1593 2.4256 1.5644 13.7688 16.5644 0.2494 74.5565 58.6792 93.7523 13.9213 1.2473 9.8251 154.9781 0.1333 35.2682 15.5989 7.3660 13.7379 14.3067 10.5773 0.7853 12.0250 19.5410 7.9137 39.8226 32.1329 14.2119
temp: 298.150 k
press: 1.00000 atm
elementType: 8 7 6 6 6 6 6 6 6 6 6 6 6 6 6 1 1 1 1 1 1 1 1 1 1 1 1 1
symmnumber: 1
zpe: 596428.4 jmol-1
zpe.correction: 0.227168 hartree
zpe.thermalcorrener: 0.240214 hartree
zpe.thermalcorrenthalpy: 0.241158 hartree
zpe.thermalcorrgfe: 0.186650 hartree
zpe.sumelectzpe: -632.124406 hartree
zpe.sumelectthermal: -632.111359 hartree
zpe.sumelectthermalent: -632.110415 hartree
zpe.sumelectthermalfe: -632.164923 hartree
dipole: -0.8538 -2.2269 2.8870
dipole: 3.7447
quadrupole: -83.8631 -78.6041 -91.4756
quadrupole: -6.2316 6.7770 1.3171
quadrupole: 0.7845 6.0435 -6.8280 -6.2316 6.7770 1.3171
hfenergy: -632.3515731 hartree
pointgroup: C01 [X(C13H13N1O1)]
dipole: -0.1662747 -1.0334367 1.0367854 debye
polarizability: 172.2341683|4.3811182|190.8500686|-11.7805994|4.5050058|85.508147 unknown
InChI: InChI=1S/C13H13NO/c1-10(15)14-9-12-7-4-6-11-5-2-3-8-13(11)12/h2-8,14H,9H2,1H3
charge 0 multiplicity 1
28 atoms
O  3.050993 1.581744 -0.729346
N  2.417211 -0.428741 0.256446
C  0.128542 -1.121831 -0.490987
C  -0.770244 -0.022743 -0.212586
C  -2.136729 -0.317298 0.1785
C  1.58303 -0.87964 -0.87848
C  -0.342475 -2.438011 -0.397673
C  -0.37002 1.353166 -0.319313
C  -2.569268 -1.682233 0.271144
C  -1.690135 -2.725406 -0.017111
C  -3.037307 0.76392 0.456556
C  -1.274071 2.383436 -0.046174
C  -2.616932 2.090766 0.34948
C  3.099825 0.777226 0.254425
C  3.906329 1.083057 1.51249
H  2.009137 -1.814445 -1.2897
H  1.68627 -0.097638 -1.651674
H  0.337499 -3.269116 -0.623912
H  0.651395 1.603778 -0.625734
H  -3.604463 -1.89123 0.566794
H  -2.024793 -3.766509 0.045189
H  -4.067385 0.528893 0.751104
H  2.442369 -1.016511 1.091241
H  -0.952264 3.426572 -0.13879
H  -3.312383 2.910423 0.561436
H  4.953633 1.28128 1.227409
H  3.513807 2.004833 1.975921
H  3.885828 0.27126 2.260045
