program: Gaussian 09
title: 000088006
version: EM64L-G09RevD.01
frameworkgroup: C1[X(C11H15NO2)]
method: RPBEPBE
basis: SDD
operation: Freq
keyword: #p
keyword: freq=noraman
keyword: PBEPBE/SDD
title: #p freq=noraman PBEPBE/SDD
converged: YES YES NO NO
title: Mulliken charges:
elementType: O O N C C C C C C C C C C C H H H H H H H H H H H H H H H
charge: -0.279805 -0.440062 -0.114303 -0.342702 -0.357802 0.136092 0.174667 -0.658117 -0.651677 0.171856 -0.344116 -0.391529 -0.252958 -0.202497 0.258238 0.200302 0.258350 0.212201 0.206333 0.253543 0.211230 0.213604 0.231707 0.214738 0.256762 0.218994 0.231315 0.229186 0.356450
chargesum: 0.00000
title: Mulliken charges with hydrogens summed into heavy atoms:
elementType: O O N C C C C C C C C C C C
charge: -0.279805 -0.083612 -0.114303 0.115838 0.112749 0.136092 0.174667 0.012989 0.008373 0.171856 -0.087354 -0.172535 -0.021643 0.026688
polarizability: 1.68830044e+02 6.20700962e+00 1.04126458e+02 4.51616223e-01 1.17034078e+01 1.20393106e+02
1716.lowfreq: -2.6597 -0.0009 -0.0005 0.0004 9.4067 11.2831 33.6788 40.9553 52.8041
frequency: 33.6101 40.9453 52.7990 64.1508 101.8765 121.1927 181.2221 195.8616 215.8499 231.7352 277.2037 302.9116 316.9443 350.9384 366.3791 421.7802 430.7054 488.4343 508.0972 541.2890 564.3356 616.3852 669.9895 698.5428 749.4428 757.5201 771.6293 775.4069 802.9144 844.5193 864.8974 936.3997 940.7645 974.6771 1001.1210 1037.4695 1062.7394 1070.7071 1080.5079 1098.4338 1104.3375 1153.9986 1171.7347 1193.3811 1215.7973 1234.7214 1269.0845 1293.5353 1301.3299 1338.3281 1355.3708 1383.9577 1385.5777 1386.5788 1414.4582 1435.0375 1453.9366 1467.1015 1469.3926 1475.5882 1481.5575 1487.0852 1488.7727 1557.1141 1597.4014 1610.1805 2981.7373 2984.5798 3001.6099 3007.5550 3066.2043 3074.6124 3082.5070 3085.3975 3103.1240 3111.2340 3113.2523 3138.6254 3150.5494 3170.1998 3579.4863
redmass: 3.2155 3.2948 3.4855 3.4279 3.5877 3.5884 3.6293 3.4587 1.0780 1.3681 4.5886 2.6260 3.0110 1.1283 3.1064 2.7088 4.1741 3.5822 3.9567 5.5192 3.7159 4.7242 4.3259 6.2318 2.1365 1.9177 1.2380 1.2541 4.1628 1.4942 2.6642 1.4527 1.9308 1.3292 2.9700 2.3296 2.6504 2.0742 1.8546 1.7973 1.7974 1.2411 1.0574 2.4100 2.6545 2.5219 1.4987 1.4342 1.3908 1.2617 1.2964 1.2506 3.4706 1.4328 2.3641 2.5375 1.1456 1.0454 1.0432 1.1005 1.0768 1.2764 1.9094 5.9181 6.5067 6.6906 1.0353 1.0357 1.0677 1.0641 1.1005 1.0988 1.0995 1.0984 1.1015 1.0888 1.0950 1.0873 1.0937 1.1005 1.0660
irintensity: 0.4907 0.1057 2.3913 1.7937 4.2720 0.3961 0.0368 0.7514 0.2228 1.5593 2.6196 1.2550 1.9797 115.8144 14.4819 7.3473 11.3723 5.7715 13.3808 4.5899 1.4563 6.6681 2.6210 13.2368 50.9926 45.5247 9.4498 7.5303 14.6512 1.8642 25.8698 0.5377 9.7957 0.1630 0.6456 14.2188 38.0493 17.6325 9.4689 25.2724 86.8396 55.2034 2.0526 22.0802 18.9741 13.4804 65.5776 62.3345 30.2691 6.8727 7.6696 7.4653 3.6498 35.9422 68.4785 92.2309 30.5303 4.5075 12.6736 12.0051 7.3502 20.5644 1.1466 249.0435 37.2735 23.9032 24.6006 29.6346 28.7007 43.8638 6.7763 21.1566 42.0367 36.2761 27.7344 13.0657 28.9712 3.3209 15.9462 20.5968 30.0320
temp: 298.150 k
press: 1.00000 atm
elementType: 8 8 7 6 6 6 6 6 6 6 6 6 6 6 1 1 1 1 1 1 1 1 1 1 1 1 1 1 1
symmnumber: 1
zpe: 627670.8 jmol-1
zpe.correction: 0.239067 hartree
zpe.thermalcorrener: 0.253772 hartree
zpe.thermalcorrenthalpy: 0.254716 hartree
zpe.thermalcorrgfe: 0.196416 hartree
zpe.sumelectzpe: -632.312591 hartree
zpe.sumelectthermal: -632.297886 hartree
zpe.sumelectthermalent: -632.296941 hartree
zpe.sumelectthermalfe: -632.355242 hartree
dipole: 0.9910 1.5166 -4.3385
dipole: 4.7015
quadrupole: -70.3679 -82.9067 -84.0349
quadrupole: -3.8225 -0.8101 9.3149
quadrupole: 8.7353 -3.8035 -4.9317 -3.8225 -0.8101 9.3149
hfenergy: -632.5516578 hartree
pointgroup: C01 [X(C11H15N1O2)]
dipole: -0.4552141 0.5538642 1.7051439 debye
polarizability: 168.8323433|-5.2813426|104.5848037|2.1469517|-12.2609926|119.9324604 unknown
InChI: InChI=1S/C11H15NO2/c1-3-12(4-2)11(14)9-7-5-6-8-10(9)13/h5-8,13H,3-4H2,1-2H3
charge 0 multiplicity 1
29 atoms
O  1.014638 -0.705771 -1.914072
O  -0.482452 -1.454899 1.512935
N  1.704528 0.326415 0.053096
C  3.121856 0.136616 -0.342343
C  1.442292 1.076042 1.301288
C  0.72532 -0.166299 -0.793543
C  -0.732995 -0.010183 -0.406665
C  3.70474 -1.185973 0.199619
C  1.444465 2.606545 1.08987
C  -1.333942 -0.701981 0.677117
C  -1.576885 0.726398 -1.27437
C  -2.729719 -0.637819 0.901905
C  -2.968855 0.810156 -1.055134
C  -3.545678 0.122482 0.037374
H  3.165893 0.136388 -1.444865
H  3.700572 1.002063 0.031038
H  0.481148 0.750787 1.725056
H  2.220609 0.791874 2.03515
H  3.645435 -1.232025 1.302477
H  3.145468 -2.041363 -0.214975
H  4.766055 -1.287088 -0.09387
H  2.399778 2.95268 0.654922
H  0.628154 2.904435 0.408349
H  1.299137 3.128358 2.054021
H  -1.123557 1.21787 -2.141725
H  -3.175818 -1.182974 1.744406
H  -3.597533 1.392281 -1.73631
H  -4.625713 0.169138 0.213836
H  -1.009641 -1.984554 2.161316
