program: Gaussian 09
title: 000087985
version: EM64L-G09RevD.01
frameworkgroup: C1[X(C7H12O2)]
method: RPBEPBE
basis: SDD
operation: Freq
keyword: #pfreq=noraman
keyword: PBEPBE/SDD
title: #p freq=noraman PBEPBE/SDD
converged: YES YES NO NO
title: Mulliken charges:
elementType: O O C C C C C C C H H H H H H H H H H H H
charge: -0.261772 -0.255478 0.468432 -0.460047 -0.798727 -0.306602 -0.731535 0.301382 -0.750124 0.227309 0.243350 0.235637 0.236081 0.221434 0.210425 0.227417 0.229810 0.222134 0.248882 0.248224 0.243769
chargesum: 0.00000
title: Mulliken charges with hydrogens summed into heavy atoms:
elementType: O O C C C C C C C
charge: -0.261772 -0.255478 0.468432 0.010612 -0.105575 -0.096177 -0.052175 0.301382 -0.009249
polarizability: 1.18113377e+02 1.14365770e+01 7.32090987e+01 1.92048478e-01 -8.00634843e-01 6.45204548e+01
1716.lowfreq: -6.6351 -0.0006 -0.0004 0.0004 4.4267 15.7004 35.7492 39.4843 51.8093
frequency: 35.6317 39.4668 51.6262 81.9533 111.1165 151.8769 213.9451 225.1127 277.0283 314.9890 354.9193 423.7157 492.1880 550.5021 586.3702 611.9197 774.7170 776.7472 845.5991 911.8384 959.2264 976.2400 995.4552 1038.9776 1041.1931 1043.7847 1054.1727 1121.3593 1196.6980 1233.9940 1239.2456 1347.6722 1364.2438 1380.5493 1395.6003 1402.7109 1453.2713 1455.1621 1456.3382 1464.8208 1466.6887 1472.8758 1479.1025 1647.5437 1695.0018 2969.5371 2976.6881 3006.4219 3006.8558 3038.6543 3048.3992 3070.8811 3092.0407 3097.1238 3099.3104 3102.4840 3140.9474
redmass: 5.8286 1.0459 3.2114 2.8121 1.0674 1.1075 2.8743 4.5875 3.0192 2.9921 2.3994 2.2497 3.2930 2.8003 3.0124 4.3317 3.8320 2.8115 1.3501 5.0037 1.7231 1.5813 1.8519 1.6139 1.5034 1.5940 1.7348 2.5983 3.2682 1.9557 1.2567 1.3591 1.2814 1.2456 1.3502 1.2526 1.0634 1.0548 1.0823 1.0522 1.0616 1.0524 1.0764 8.8649 6.4469 1.0382 1.0384 1.0395 1.0574 1.0968 1.0967 1.0899 1.1036 1.0982 1.0949 1.0958 1.1022
irintensity: 1.1332 0.7546 0.9869 2.9005 1.0003 1.0624 5.9014 6.1636 1.8258 3.4974 2.2010 4.1337 9.0030 3.0085 9.9551 0.9482 6.4512 20.2358 25.6652 95.2047 7.9947 61.1900 52.1318 26.9892 0.6524 5.3606 7.8110 0.9904 318.1724 2.6552 20.5381 4.6590 0.8166 53.5709 11.7630 21.1447 26.6711 13.1598 9.2531 1.8591 25.0146 29.9249 14.5299 190.0045 6.5362 37.8425 19.6198 2.2666 25.6254 23.2697 20.7493 5.2500 5.7247 36.9591 9.0885 48.0532 10.3538
temp: 298.150 k
press: 1.00000 atm
elementType: 8 8 6 6 6 6 6 6 6 1 1 1 1 1 1 1 1 1 1 1 1
symmnumber: 1
zpe: 459740.0 jmol-1
zpe.correction: 0.175106 hartree
zpe.thermalcorrener: 0.186601 hartree
zpe.thermalcorrenthalpy: 0.187545 hartree
zpe.thermalcorrgfe: 0.136238 hartree
zpe.sumelectzpe: -423.660180 hartree
zpe.sumelectthermal: -423.648685 hartree
zpe.sumelectthermalent: -423.647741 hartree
zpe.sumelectthermalfe: -423.699047 hartree
dipole: -1.2789 -1.0824 1.1888
dipole: 2.0543
quadrupole: -49.6808 -55.5812 -55.7784
quadrupole: -3.4644 4.9629 3.7895
quadrupole: 3.9993 -1.9011 -2.0982 -3.4644 4.9629 3.7895
hfenergy: -423.8352855 hartree
pointgroup: C01 [X(C7H12O2)]
dipole: -0.4881886 0.0595353 0.6413878 debye
dipolederiv: -1.5444766 -0.3582732 0.2406006 -0.5140698 -0.4828736 0.0661548 0.1699933 0.0557625 -0.5346984 -0.6890456 -0.1335231 0.0187018 -0.1034636 -0.3745087 -0.1172173 0.3686855 0.0193772 -0.9479889 -0.0846432 -0.0071229 -0.0444877 0.0332049 0.0989755 -0.1811944 -0.0586756 -0.1803526 -0.0150425 0.848905 0.1141918 -0.0311414 0.2014508 0.3178696 0.0250091 0.3938699 0.1007754 0.1889186 -0.0400789 -0.0161614 0.0356104 0.0205251 -0.1037465 0.0956261 0.0439224 0.0997637 0.0093531 0.2215463 -0.0799792 -0.0868278 -0.1119793 -0.0270204 -0.0997335 -0.1308656 -0.1322194 -0.1472014 -0.1913055 0.0649318 0.0401354 0.0284473 0.0359685 0.0360676 0.1158587 0.03957 0.0670766 1.560209 0.5408477 -0.1681772 0.5694608 0.4360282 0.0797795 -0.6518257 -0.0517405 1.2470209 -0.2551435 -0.1366383 -0.1603526 -0.1293137 -0.0175781 -0.0601855 -0.1853255 -0.1167782 -0.1613714 0.0025858 -0.0604956 0.0019586 -0.0306537 -0.0828637 0.0730611 -0.0477196 0.1229026 0.0370554 -0.011344 0.0339499 0.0629054 -0.0138106 0.0894359 0.00361 -0.0649192 -0.0936177 -0.0306344 0.0185324 -0.1191718 -0.0576816 -0.1295585 -0.0149496 -0.0128482 -0.0593209 -0.0650025 0.0321909 0.0841547 0.0131407 0.1018696 -0.0062163 0.0623903 -0.0450994 0.1013004 0.0054379 -0.0828206 -0.1026969 0.1354059 -0.0528397 0.0952546 0.0348118 0.0221293 -0.0154534 0.0165097 0.1026929 0.0321078 0.0645064 -0.0036269 0.0574298 -0.0893696 0.1310923 -0.0061449 0.1260177 0.0752764 -0.0899746 -0.0908448 -0.0362968 -0.0958387 -0.0045074 -0.0723731 -0.1029848 -0.0609586 0.0906879 0.0084117 0.0127424 0.0644802 0.0839378 0.1084018 -0.0487649 0.0955639 -0.0457424 -0.1197231 0.0902181 -0.0064901 0.0086605 0.0663555 -0.0814884 0.1005681 -0.0418511 0.1170759 0.0355677 0.0532692 0.0413813 -0.0590601 0.0767364 -0.0004322 0.0609246 -0.0575845 0.0471631 0.0855015 0.0616232 0.0658037 0.0817063 0.0111133 0.052353 -0.088727 0.0649791 -0.0755211 0.0361608 0.0271457 -0.0782011 0.043863 -0.1090122 0.0431036 0.0321209 0.0684977 0.0715774 0.0319781 unknown
polarizability: 115.4364468|11.9693302|68.9490908|-10.1733067|-5.3360095|71.457393 unknown
InChI: InChI=1S/C7H12O2/c1-4-6(2)5-9-7(3)8/h4H,5H2,1-3H3
charge 0 multiplicity 1
21 atoms
O  1.015026 -0.159853 0.629821
O  2.200533 0.131754 -1.368587
C  -1.340626 -0.125653 -0.153206
C  -0.06106 -0.932215 -0.092297
C  -1.249942 1.171984 -0.931318
C  -2.46054 -0.61396 0.455351
C  -3.845547 -0.010398 0.476799
C  2.094035 0.304478 -0.132675
C  3.096427 1.008099 0.758532
H  -0.185263 -1.854919 0.497217
H  0.327978 -1.164274 -1.10181
H  -0.56838 1.880368 -0.422115
H  -0.826554 0.996478 -1.938752
H  -2.226088 1.668995 -1.04747
H  -2.364085 -1.565827 1.002105
H  -4.589782 -0.719926 0.065364
H  -4.15757 0.207642 1.517234
H  -3.915821 0.926999 -0.099025
H  3.714306 0.255797 1.281861
H  2.582598 1.609362 1.525242
H  3.756256 1.641266 0.147129
