program: Gaussian 09
title: 000087963
version: EM64L-G09RevD.01
frameworkgroup: C1[X(C6H8N2O2)]
method: RPBEPBE
basis: SDD
operation: Freq
keyword: #pfreq=noraman
keyword: PBEPBE/SDD
title: #p freq=noraman PBEPBE/SDD
converged: NO YES NO NO
title: Mulliken charges:
elementType: O O N N C C C C C C H H H H H H H H
charge: -0.284683 -0.242861 -0.199770 -0.089729 -0.219984 0.337395 -0.165063 -0.669106 -0.160688 -0.298231 0.237138 0.237074 0.287825 0.219027 0.233646 0.233660 0.285654 0.258697
chargesum: 0.00000
title: Mulliken charges with hydrogens summed into heavy atoms:
elementType: O O N N C C C C C C
charge: -0.284683 -0.242861 -0.199770 -0.089729 0.254228 0.337395 0.122762 0.017226 0.124966 -0.039534
polarizability: 1.15982728e+02 -3.67898605e+00 8.63330429e+01 2.68122981e-02 2.27101615e-02 4.51164838e+01
1716.lowfreq: -9.0959 -1.8147 -0.0008 0.0002 0.0003 5.8441 35.0229 82.6453 108.1460
frequency: 34.4663 82.6372 108.1375 111.1724 193.4741 250.0153 250.3630 333.9080 393.5459 516.2866 594.3725 642.2170 712.4636 756.5164 776.9263 799.9179 808.8474 826.2803 867.3477 872.6779 969.7144 1016.6375 1035.6457 1095.9087 1112.4981 1119.7363 1137.3863 1211.8614 1248.4292 1253.1034 1269.7500 1343.4414 1379.0993 1403.8914 1442.3871 1464.0945 1474.1057 1486.7222 1492.1341 1652.7222 3000.3899 3017.7203 3078.9061 3097.3640 3114.0194 3238.2275 3256.7477 3279.1352
redmass: 2.4185 3.5571 3.8906 4.0244 3.3572 5.2136 1.3651 3.9646 5.3863 6.0924 3.2859 3.6515 8.0736 1.2386 7.6815 1.1022 1.4128 3.9263 1.4149 6.3432 5.0616 2.1528 2.1947 1.7781 2.5774 3.1080 1.4605 1.7394 2.5103 1.1308 2.9018 1.9482 2.3673 1.2956 3.8844 1.0396 1.0618 1.0845 4.4006 11.9289 1.0360 1.0581 1.1071 1.0984 1.1033 1.0937 1.0986 1.1079
irintensity: 1.2720 0.1850 0.6024 0.2498 4.7878 8.7042 1.9326 11.9528 1.9069 2.3443 1.9083 12.8703 33.4564 35.2034 3.4755 1.3520 65.3706 2.9465 0.0957 3.7344 139.8409 99.5503 4.8663 33.1724 63.2160 151.7139 5.9396 189.2537 5.2649 0.0226 321.9700 52.1719 126.6889 17.2295 77.1750 13.4356 4.1389 16.5768 16.0306 303.3932 15.4433 16.7753 4.7792 25.3431 40.4123 4.9222 3.2558 2.7451
temp: 298.150 k
press: 1.00000 atm
elementType: 8 8 7 7 6 6 6 6 6 6 1 1 1 1 1 1 1 1
symmnumber: 1
zpe: 362608.2 jmol-1
zpe.correction: 0.138110 hartree
zpe.thermalcorrener: 0.147708 hartree
zpe.thermalcorrenthalpy: 0.148652 hartree
zpe.thermalcorrgfe: 0.102001 hartree
zpe.sumelectzpe: -492.627312 hartree
zpe.sumelectthermal: -492.617714 hartree
zpe.sumelectthermalent: -492.616770 hartree
zpe.sumelectthermalfe: -492.663421 hartree
dipole: -4.5004 -2.1128 -0.0043
dipole: 4.9716
quadrupole: -60.1331 -58.8729 -59.1627
quadrupole: -0.6257 -0.0161 -0.0008
quadrupole: -0.7435 0.5167 0.2269 -0.6257 -0.0161 -0.0008
hfenergy: -492.7654219 hartree
pointgroup: C01 [X(C6H8N2O2)]
dipole: -1.7572095 -0.8591258 -0.0019005 debye
dipolederiv: -1.6969045 -0.2889046 0.0001421 -0.6247306 -0.6453243 -0.0004318 0.0019958 0.0005971 -0.2838639 -0.7374857 0.149605 -0.0004164 0.1458344 -1.0038314 0.0014711 0.0003034 -0.0016708 -0.3280939 -1.7307952 0.444445 -0.001223 0.4420954 -0.3695651 0.0002227 -0.0029656 0.0006011 -0.0254145 -0.5897423 0.1021621 -0.0002472 0.380778 -0.3673564 0.0003474 0.0000399 0.0000545 -0.2591183 1.0682784 0.1171334 -0.0004913 -0.0213122 0.2482404 0.0000179 -0.0005389 -0.0001805 0.3465401 2.545472 -0.2454657 0.0011171 0.1045005 1.5455567 -0.0012998 0.0004632 0.0005085 0.3480895 0.2192245 -0.1570986 0.0003499 -0.4984641 0.0947586 -0.0004902 0.0002867 -0.0000781 -0.149375 -0.1007357 -0.087951 0.0000897 -0.0739291 -0.0372544 0.0001502 0.0001882 0.0001411 0.0586012 0.9596672 -0.1037427 0.0013299 0.1828394 0.0118856 0.0001927 0.0013447 -0.0000835 -0.0655406 -0.1794522 -0.0278614 0.000206 -0.1880066 0.2631921 0.0000163 -0.0003706 0.0002379 -0.1659599 -0.0544426 -0.0329462 -0.012153 0.0498119 0.0079321 -0.088652 0.0250643 -0.0950925 -0.0496508 -0.0543184 -0.0326062 0.0119724 0.0501809 0.0079297 0.0886338 -0.0252473 0.0952335 -0.049706 0.0877725 -0.0656653 -0.0003044 -0.0308102 0.0921389 -0.0000561 -0.0002325 -0.0001501 0.2240668 -0.1492664 0.0393455 0.0003047 0.055286 0.067394 -0.0000923 0.0003684 -0.0000591 0.1214973 0.1186236 0.0358478 0.0526379 -0.0196367 0.0121758 -0.0918407 0.0299177 -0.1065275 -0.0573964 0.1184071 0.0361367 -0.0530413 -0.0193745 0.0122066 0.0918632 -0.0304133 0.1064083 -0.0571884 0.1091695 0.0318064 -0.0001361 0.0153751 0.0591646 -0.0000523 -0.0000534 0.0000537 0.1988265 0.0665283 0.0857598 -0.000137 0.0495625 0.0007566 0. -0.0001509 0.0000064 0.1936862 unknown
polarizability: 116.091646|-3.2082953|86.224117|0.0444974|0.0118895|45.1164921 unknown
InChI: InChI=1S/C6H8N2O2/c1-2-10-6(9)8-4-3-7-5-8/h3-5H,2H2,1H3
charge 0 multiplicity 1
18 atoms
O  -1.47295 -0.309017 -0.00238
O  -0.748167 1.922762 -0.000812
N  0.781231 0.131777 -0.001538
N  3.048883 0.079635 0.002426
C  -2.899313 0.160788 -0.000394
C  -0.519401 0.695184 -0.003727
C  1.14791 -1.234924 -0.001229
C  -3.768706 -1.090389 0.000847
C  1.9800 0.880282 0.001211
C  2.53462 -1.243169 0.001018
H  -3.050051 0.787782 0.89614
H  -3.052466 0.787697 -0.896581
H  0.400652 -2.020992 -0.002859
H  -4.834522 -0.798757 0.002265
H  -3.57953 -1.704824 -0.89538
H  -3.577113 -1.70473 0.896622
H  1.975296 1.966585 0.001676
H  3.204625 -2.099189 0.001694
