program: Gaussian 09
title: 000087961
version: EM64L-G09RevD.01
frameworkgroup: C1[X(C3H5NS2)]
method: RPBEPBE
basis: SDD
operation: Freq
keyword: #pfreq=noraman
keyword: PBEPBE/SDD
title: #p freq=noraman PBEPBE/SDD
converged: NO YES NO NO
title: Mulliken charges:
elementType: S S N C C C H H H H H
charge: 0.291675 0.230950 -0.215871 -0.635953 -0.626901 -0.416617 0.271460 0.289521 0.270525 0.290179 0.251031
chargesum: 0.00000
title: Mulliken charges with hydrogens summed into heavy atoms:
elementType: S S N C C C
charge: 0.291675 0.230950 0.035160 -0.074971 -0.066197 -0.416617
polarizability: 9.58883284e+01 -1.17062402e-01 7.61377267e+01 5.19805317e-02 -2.09295051e+00 3.73956321e+01
1716.lowfreq: -9.2962 -0.0040 -0.0033 -0.0027 3.4113 6.0737 96.3837 229.8078 351.4269
frequency: 96.3675 229.8071 351.4267 395.3048 432.4802 491.6874 504.8807 622.4872 641.6250 712.5636 748.7061 858.7702 956.2621 1008.4735 1044.1110 1115.2957 1155.6057 1272.8682 1294.9583 1431.2836 1438.6023 1616.4073 3036.3489 3042.3046 3110.6131 3127.2017 3413.0871
redmass: 5.1615 2.0300 5.5200 15.7944 3.7887 9.7957 7.2580 6.5444 3.6186 3.8227 1.1691 1.5906 1.4571 2.5062 1.5202 1.0484 1.3290 1.2545 1.1812 1.0816 1.0964 6.8616 1.0551 1.0589 1.1083 1.1092 1.0790
irintensity: 2.2552 1.6348 14.3557 3.4044 2.1942 14.5102 3.3906 5.4878 0.5799 98.9080 92.2200 11.6346 1.1027 11.4625 281.7828 3.0311 5.6228 5.8826 10.5813 15.5405 2.7610 228.8855 12.8448 26.3535 0.5720 14.7329 14.7575
temp: 298.150 k
press: 1.00000 atm
elementType: 16 16 7 6 6 6 1 1 1 1 1
symmnumber: 1
zpe: 204259.5 jmol-1
zpe.correction: 0.077798 hartree
zpe.thermalcorrener: 0.084037 hartree
zpe.thermalcorrenthalpy: 0.084981 hartree
zpe.thermalcorrgfe: 0.047119 hartree
zpe.sumelectzpe: -967.707971 hartree
zpe.sumelectthermal: -967.701732 hartree
zpe.sumelectthermalent: -967.700788 hartree
zpe.sumelectthermalfe: -967.738651 hartree
dipole: -3.2932 1.4025 0.0624
dipole: 3.5799
quadrupole: -45.5919 -53.7908 -51.7920
quadrupole: 5.1337 -0.0100 0.4338
quadrupole: 4.7997 -3.3992 -1.4004 5.1337 -0.0100 0.4338
hfenergy: -967.7857694 hartree
pointgroup: C01 [X(C3H5N1S2)]
dipole: -1.3117286 0.5129414 0.0024145 debye
dipolederiv: -0.2933362 -0.1777086 0.0165584 -0.271658 -0.3902284 -0.0322675 0.0456443 0.0097037 -0.0513652 -0.4932878 0.2080869 -0.0093514 0.3122467 -0.4964699 -0.0258916 -0.0471835 0.0223414 -0.0450554 -1.5423143 -0.0435154 0.0041184 0.2165661 -0.2775872 -0.0118126 0.000622 -0.0021339 -0.3878577 0.2032041 -0.0694043 0.0705747 -0.1059072 -0.0158021 -0.0462628 0.0851763 0.003981 0.1142301 0.1919506 0.0939181 -0.0707616 0.1601827 0.008809 -0.0484559 -0.0949 -0.0034293 0.1291896 1.6127972 0.0336296 -0.0007902 -0.1190446 0.9675878 -0.0021963 0.0001927 -0.0510944 -0.0488044 -0.0259296 -0.0697349 0.0302224 -0.0935553 0.016 0.0392094 0.035258 0.0304529 0.0941307 0.006334 0.0214942 -0.0365509 0.0775422 0.067027 0.0410517 -0.0697084 -0.0226744 -0.0974552 -0.056693 0.0712521 -0.0285772 0.0803498 0.0275798 0.03482 -0.0251217 0.0260944 0.0945824 0.0110378 -0.0268637 0.0287399 -0.0791231 0.0609694 0.0433963 0.0656391 -0.0207527 -0.0981734 0.3862372 -0.0411539 -0.0041824 -0.1775994 0.0321147 0.0084093 0.0043812 0.0075112 0.2965785 unknown
polarizability: 95.8769358|0.466129|75.8025492|-0.1794867|-4.2051075|37.7422023 unknown
InChI: InChI=1S/C3H5NS2/c4-3-5-1-2-6-3/h4H,1-2H2
charge 0 multiplicity 1
11 atoms
S  0.019585 -1.49938 0.154242
S  -0.073578 1.582411 -0.192326
N  2.288875 -0.006572 -0.013473
C  -1.635502 -0.706032 -0.296117
C  -1.674963 0.704381 0.301466
C  1.003893 0.053134 -0.021467
H  -2.420876 -1.348002 0.135857
H  -1.723442 -0.684564 -1.393433
H  -2.506176 1.297512 -0.113329
H  -1.73155 0.682878 1.400811
H  2.804132 0.889633 -0.051231
