program: Gaussian 09
title: 000088059
version: EM64L-G09RevD.01
frameworkgroup: C1[X(C14H19N3O2)]
method: RPBEPBE
basis: SDD
operation: Freq
keyword: #p
keyword: freq=noraman
keyword: PBEPBE/SDD
title: #p freq=noraman PBEPBE/SDD
converged: YES YES NO NO
title: Mulliken charges:
elementType: O O N N N C C C C C C C C C C C C C C H H H H H H H H H H H H H H H H H H H
charge: -0.304078 -0.252683 -0.197970 -0.461055 -0.019055 0.412618 -0.455787 -0.360501 0.133273 -0.630338 -0.419214 0.525299 -0.684730 -0.329639 -0.382163 -0.148089 0.215603 -0.522013 -0.783185 0.230598 0.303907 0.192079 0.222345 0.225889 0.250457 0.268097 0.224529 0.245108 0.215310 0.250692 0.313118 0.298993 0.235265 0.224400 0.233762 0.259267 0.259286 0.210607
chargesum: 0.00000
title: Mulliken charges with hydrogens summed into heavy atoms:
elementType: O O N N N C C C C C C C C C C C C C C
charge: -0.304078 -0.252683 -0.197970 -0.162062 -0.019055 0.412618 0.078717 0.053923 0.133273 -0.404450 0.099339 0.525299 0.000217 -0.078947 -0.069044 -0.148089 0.215603 0.171414 -0.054025
polarizability: 2.61914286e+02 7.79572247e+00 1.67556963e+02 6.56150261e+00 -1.30834907e+01 1.38327010e+02
1716.lowfreq: -11.5987 -5.2257 -0.0006 -0.0005 0.0001 2.1050 25.4395 39.5981 50.8023
frequency: 25.3817 39.5976 50.7990 55.7951 68.2513 73.7623 80.0086 81.1929 100.3967 129.3086 140.4268 152.1768 158.5673 185.4438 207.1061 231.8666 255.1710 272.9255 302.8667 318.3756 358.1739 370.4721 387.7449 422.2357 447.6557 461.6000 494.8184 496.5883 552.1283 569.5387 590.3922 622.1628 628.9305 656.9641 708.8804 740.1425 755.6004 778.6376 799.3964 840.7964 853.5291 861.0037 909.0326 942.9753 946.3080 964.9267 974.5385 980.5395 998.4251 1026.3872 1039.6787 1049.7117 1088.6231 1091.6856 1111.1524 1129.3174 1150.1596 1167.2154 1188.0949 1196.8866 1219.8621 1245.6333 1266.0640 1273.6073 1286.6818 1299.7594 1335.5417 1359.8831 1367.2668 1372.9476 1388.1135 1390.9000 1397.4782 1425.5064 1447.5718 1448.9337 1457.0569 1464.4413 1469.5091 1474.1593 1482.2129 1485.9913 1495.0119 1500.9035 1512.2722 1582.7021 1613.7311 1625.4884 2192.2854 2900.4090 2965.7919 2990.4373 2993.4201 2993.8790 3015.3649 3031.3571 3051.5498 3058.9461 3086.9564 3093.4491 3094.7799 3095.7199 3098.6270 3116.9921 3124.9197 3156.4011 3205.0495 3535.5881
redmass: 6.8093 6.0741 4.3438 1.6535 2.6324 2.3950 2.7201 2.7532 3.0848 2.9914 3.3086 4.0048 1.1002 1.5277 3.9542 2.4524 4.2290 3.7276 3.7461 4.2727 3.6633 3.4540 3.6978 3.6832 3.8919 4.4157 4.0616 4.5242 3.9370 4.4244 3.4974 1.6121 3.4667 2.6766 4.7850 3.1356 4.1435 1.2827 1.1857 1.8959 2.3926 1.6214 3.1201 5.7792 6.9882 3.3488 1.3284 4.5270 1.7064 2.6351 1.6276 1.7976 2.2247 2.2482 1.2491 1.4922 1.3396 1.9121 2.2554 2.2576 2.3144 1.6061 1.4766 1.3201 1.2385 1.6237 1.4572 2.4921 1.4363 2.5907 1.2633 1.2310 1.9789 1.2378 1.0903 1.0453 1.0564 1.0465 1.0948 1.0568 1.0829 1.0688 2.4337 1.3232 1.9472 5.7887 6.5524 4.7794 12.4142 1.0710 1.0304 1.0358 1.0585 1.0365 1.0625 1.0882 1.1007 1.1047 1.0991 1.1047 1.1001 1.1007 1.0983 1.1019 1.0896 1.0908 1.0950 1.0764
irintensity: 1.0765 5.5454 3.0874 3.4817 4.3445 1.7623 1.3285 3.6036 3.9839 2.0840 0.6053 6.8061 0.0764 4.2042 3.3182 2.7664 1.5983 5.3235 1.4983 8.0600 3.0744 2.7758 0.0208 0.7228 14.7468 4.6360 3.2137 30.4570 12.5332 10.9557 2.9602 45.3870 14.6485 7.2019 3.4997 2.0342 6.6843 7.8331 10.4101 3.8544 8.3903 73.0051 12.1947 7.2578 45.3844 11.6731 1.0366 11.5811 9.5527 27.2511 14.1127 20.6576 8.5316 41.9772 7.8218 34.7233 1.9796 29.3311 23.5241 84.3004 89.7814 89.1338 10.8070 24.2950 5.0378 33.9488 43.6139 185.5589 27.3373 11.8742 70.3604 22.9286 45.6393 18.1361 5.0385 15.2747 10.7314 3.8437 20.8499 1.0653 56.4263 39.2880 373.6517 4.1242 85.7758 28.3781 201.2999 94.3319 36.5712 72.5816 67.6022 27.1484 5.5163 15.2351 36.4871 27.2528 5.9494 33.0191 39.2487 4.7792 21.5045 32.5799 8.4887 25.6146 15.3024 5.0876 9.2470 8.9813
temp: 298.150 k
press: 1.00000 atm
elementType: 8 8 7 7 7 6 6 6 6 6 6 6 6 6 6 6 6 6 6 1 1 1 1 1 1 1 1 1 1 1 1 1 1 1 1 1 1 1
symmnumber: 1
zpe: 812106.6 jmol-1
zpe.correction: 0.309315 hartree
zpe.thermalcorrener: 0.330083 hartree
zpe.thermalcorrenthalpy: 0.331027 hartree
zpe.thermalcorrgfe: 0.258041 hartree
zpe.sumelectzpe: -858.134362 hartree
zpe.sumelectthermal: -858.113594 hartree
zpe.sumelectthermalent: -858.112650 hartree
zpe.sumelectthermalfe: -858.185636 hartree
dipole: -1.9303 -3.6320 5.9421
dipole: 7.2267
quadrupole: -141.3469 -103.5848 -121.7306
quadrupole: 19.0720 14.2765 -1.6351
quadrupole: -19.1261 18.6360 0.4901 19.0720 14.2765 -1.6351
hfenergy: -858.443677 hartree
pointgroup: C01 [X(C14H19N3O2)]
dipole: -0.5865264 0.4802504 2.7402893 debye
polarizability: 259.5164729|17.0232706|143.0343895|-6.6424077|-16.9799069|165.2473974 unknown
InChI: InChI=1S/C14H19N3O2/c1-4-17(9-5-8-15)13-10-12(16-11(2)18)6-7-14(13)19-3/h6-7,10,16H,4-5,9H2,1-3H3
charge 0 multiplicity 1
38 atoms
O  1.388447 1.82341 -1.807476
O  -4.769391 -0.462425 -0.802145
N  1.747269 0.532781 0.789986
N  -3.004064 -0.720617 0.727677
N  5.144026 -2.308001 -1.397377
C  0.481418 0.532536 0.129768
C  2.918348 0.060976 0.01982
C  1.801339 0.288505 2.250967
C  0.316176 1.15961 -1.151122
C  -0.666957 -0.070245 0.708642
C  2.941423 -1.501379 -0.135708
C  -1.921041 -0.089199 0.044196
C  1.160042 1.424891 3.072298
C  -0.920706 1.101478 -1.81857
C  -2.052026 0.485322 -1.245486
C  4.148038 -1.966188 -0.834356
C  -4.32591 -0.884062 0.306486
C  1.766618 3.114044 -1.188287
C  -5.221073 -1.627302 1.297588
H  3.840119 0.387262 0.534203
H  2.900567 0.519407 -0.98182
H  1.34497 -0.688706 2.534702
H  2.870917 0.213598 2.521042
H  -0.579776 -0.559115 1.686347
H  2.900159 -1.986079 0.858783
H  2.045946 -1.822831 -0.700237
H  1.685063 2.377207 2.882508
H  0.096792 1.566642 2.81337
H  1.224088 1.199685 4.152759
H  -0.986961 1.575901 -2.803115
H  -3.013308 0.457483 -1.758922
H  -2.776521 -1.10437 1.647202
H  2.082934 2.969951 -0.138093
H  0.915362 3.819587 -1.230541
H  2.602907 3.497831 -1.792535
H  -5.613491 -2.53741 0.811718
H  -6.087941 -0.989972 1.542585
H  -4.715601 -1.916307 2.235841
