program: Gaussian 09
title: 000087978
version: EM64L-G09RevD.01
frameworkgroup: C1[X(C12H22N2)]
method: RPBEPBE
basis: SDD
operation: Freq
keyword: #pfreq=noraman
keyword: PBEPBE/SDD
title: #p freq=noraman PBEPBE/SDD
converged: YES YES NO YES
title: Mulliken charges:
elementType: N N C C C C C C C C C C C C H H H H H H H H H H H H H H H H H H H H H H
charge: -0.101297 -0.101315 -0.353985 -0.398105 -0.353982 -0.398081 -0.279219 -0.279211 0.351874 0.351861 -0.781985 -0.808806 -0.781979 -0.808779 0.208974 0.202391 0.235987 0.197121 0.208976 0.202391 0.235965 0.197116 0.202482 0.202471 0.217627 0.210766 0.211872 0.252111 0.216681 0.215517 0.211872 0.217628 0.210767 0.215516 0.252092 0.216684
chargesum: 0.00000
title: Mulliken charges with hydrogens summed into heavy atoms:
elementType: N N C C C C C C C C C C C C
charge: -0.101297 -0.101315 0.057380 0.035002 0.057385 0.035001 -0.076737 -0.076740 0.351874 0.351861 -0.141719 -0.124496 -0.141711 -0.124487
polarizability: 2.26715056e+02 -8.22554657e-04 1.37534152e+02 2.31965960e+00 4.46122438e-05 1.03707181e+02
1716.lowfreq: -3.1495 -0.0009 -0.0008 -0.0002 8.1671 19.7432 33.5312 48.5728 69.0411
frequency: 33.2804 48.5713 69.0388 74.0179 95.6851 137.1259 160.3616 165.7266 192.7131 207.0513 222.7694 241.9338 250.3733 286.1888 286.8961 347.6904 353.8538 366.6827 374.1587 401.1651 441.5714 466.6069 467.2112 508.8829 604.0802 646.7708 774.8400 805.7392 814.7304 832.7002 851.4730 856.2477 861.7538 959.4476 959.7723 963.3031 995.2321 996.1384 1005.0374 1011.3191 1049.3418 1053.8362 1062.8320 1070.2270 1071.3211 1089.6980 1155.5512 1165.1736 1198.5552 1209.1604 1209.2475 1222.1660 1258.3818 1285.3317 1338.3764 1347.4019 1347.4862 1364.1569 1368.6065 1373.4200 1387.8913 1388.1921 1399.6900 1402.1465 1404.2170 1406.2855 1451.6596 1452.5396 1456.5942 1457.1827 1458.8925 1461.0550 1473.1614 1473.5851 1481.0295 1481.3530 1492.0004 1492.6758 1686.3055 1688.1069 2890.0938 2897.4202 2904.9709 2911.0465 2940.9980 2941.2023 2947.5517 2948.0761 3006.3611 3006.3744 3012.6446 3012.7281 3039.0172 3039.8812 3063.2773 3063.3892 3069.4247 3069.6236 3074.3090 3075.7933 3106.9290 3107.1935
redmass: 3.4443 2.5786 2.8572 2.5584 3.7198 1.6242 1.2025 1.4338 1.1860 1.4445 2.4832 2.0614 2.7002 2.7787 2.4804 2.2260 2.9868 2.3969 1.9199 2.3742 2.5383 2.5037 2.9105 2.6729 5.0191 1.9760 4.1760 3.5515 3.5364 2.4333 1.6658 1.3826 1.4818 1.4188 1.3697 2.0431 1.3284 1.2756 2.0451 2.1058 1.6921 1.6157 1.7807 1.5885 1.5561 1.9968 3.9421 2.2873 1.8495 1.1416 2.3829 1.5370 3.5931 1.6851 1.2717 1.3232 1.8401 1.3967 1.8148 1.4905 1.2541 1.2513 1.3723 1.4160 1.2679 1.2949 1.0684 1.0705 1.0611 1.0772 1.0835 1.0961 1.0496 1.0522 1.0727 1.0718 1.0616 1.0627 6.3376 6.4082 1.0700 1.0708 1.0696 1.0683 1.0379 1.0381 1.0430 1.0428 1.0970 1.0970 1.0938 1.0937 1.0940 1.0888 1.0942 1.0943 1.0908 1.0904 1.0926 1.0885 1.0927 1.0927
irintensity: 0.0938 0.0024 0.0624 1.7605 0.0002 0.3435 0.0622 10.4054 0.7158 4.9511 0.0041 11.6113 1.1643 4.5067 2.1506 0.7234 5.3755 0.3361 2.4480 2.2552 17.7778 3.1307 2.2538 3.7795 0.7536 11.0504 1.4904 0.6695 0.0005 1.1338 3.5922 21.2480 49.3971 1.1221 1.1687 0.3065 1.8202 0.6874 75.4704 1.6039 1.1137 40.6908 0.9931 5.5734 3.6909 4.7582 47.8056 32.8822 291.2100 32.8853 3.7945 11.7192 14.1249 23.7548 1.4704 8.0194 31.9834 0.4108 9.5294 97.4912 10.2996 18.8932 0.2139 90.6431 8.6698 4.3621 9.9213 10.1550 0.3205 71.5923 8.9486 3.6765 6.3419 4.0755 0.6733 13.3754 15.7646 2.4035 266.8783 6.5149 53.2597 42.6750 33.3936 191.4401 137.6903 4.5794 94.5792 94.9613 24.3695 54.1230 70.7553 4.8700 34.0087 37.6998 23.4033 2.4578 42.3030 86.7129 29.1615 23.2842 61.0825 0.1693
temp: 298.150 k
press: 1.00000 atm
elementType: 7 7 6 6 6 6 6 6 6 6 6 6 6 6 1 1 1 1 1 1 1 1 1 1 1 1 1 1 1 1 1 1 1 1 1 1
symmnumber: 1
zpe: 836795.5 jmol-1
zpe.correction: 0.318719 hartree
zpe.thermalcorrener: 0.335229 hartree
zpe.thermalcorrenthalpy: 0.336174 hartree
zpe.thermalcorrgfe: 0.274758 hartree
zpe.sumelectzpe: -578.795362 hartree
zpe.sumelectthermal: -578.778851 hartree
zpe.sumelectthermalent: -578.777907 hartree
zpe.sumelectthermalfe: -578.839322 hartree
dipole: -0.0002 0.1591 0.0001
dipole: 0.1591
quadrupole: -91.8612 -81.9394 -90.5113
quadrupole: 0.0003 -0.2963 0.0002
quadrupole: -3.7572 6.1646 -2.4074 0.0003 -0.2963 0.0002
hfenergy: -579.1140803 hartree
pointgroup: C01 [X(C12H22N2)]
dipole: -0.0000697 -0.0625804 -0.0000015 debye
polarizability: 226.6732314|0.0011587|137.534144|-3.2440534|-0.0169231|103.7490147 unknown
InChI: InChI=1S/C12H22N2/c1-11(2)9-13-5-7-14(8-6-13)10-12(3)4/h9-10H,5-8H2,1-4H3
charge 0 multiplicity 1
36 atoms
N  1.432183 -0.512585 -0.098152
N  -1.43212 -0.512484 0.098862
C  0.718585 -1.748317 0.27941
C  0.718633 0.71403 0.286955
C  -0.718529 -1.74856 -0.277598
C  -0.718557 0.713788 -0.287346
C  2.82739 -0.588515 -0.30572
C  -2.827344 -0.58827 0.306436
C  3.847985 0.282872 -0.015975
C  -3.848025 0.282724 0.015802
C  5.239708 -0.023095 -0.551898
C  3.76372 1.564968 0.798641
C  -5.239703 -0.022847 0.552055
C  -3.763972 1.563969 -0.800184
H  0.676985 -1.855423 1.388656
H  1.271588 -2.617142 -0.123028
H  1.257989 1.584908 -0.120237
H  0.652962 0.823261 1.395026
H  -0.676944 -1.856671 -1.386746
H  -1.271533 -2.617018 0.125636
H  -1.257902 1.585022 0.11909
H  -0.652883 0.822036 -1.395516
H  3.101184 -1.515216 -0.834008
H  -3.10108 -1.514448 0.835673
H  5.272021 -0.984052 -1.096441
H  5.983651 -0.068075 0.269866
H  5.589344 0.765349 -1.251021
H  2.85236 1.637654 1.411007
H  3.82401 2.471911 0.160535
H  4.6281 1.615833 1.490653
H  -5.589457 0.766331 1.250292
H  -5.271882 -0.983196 1.097675
H  -5.983631 -0.068845 -0.269667
H  -4.628405 1.613971 -1.492195
H  -2.852671 1.636146 -1.412691
H  -3.82436 2.471584 -0.163046
