program: Gaussian 09
title: 000087964
version: EM64L-G09RevD.01
frameworkgroup: C1[X(C7H14N2O4S2)]
method: RPBEPBE
basis: SDD
operation: Freq
keyword: #p
keyword: freq=noraman
keyword: PBEPBE/SDD
title: #p freq=noraman PBEPBE/SDD
converged: YES YES NO NO
title: Mulliken charges:
elementType: S S O O O O N N C C C C C C C H H H H H H H H H H H H H H
charge: 0.950259 0.950259 -0.534944 -0.534883 -0.534944 -0.534883 -0.282278 -0.282278 -0.407507 -0.407225 -0.407506 -0.407226 -0.570259 -0.570259 -0.283238 0.258181 0.288748 0.288403 0.258243 0.288748 0.258180 0.258243 0.288404 0.281026 0.281223 0.281026 0.281223 0.272633 0.272630
chargesum: 0.00000
title: Mulliken charges with hydrogens summed into heavy atoms:
elementType: S S O O O O N N C C C C C C C
charge: 0.950259 0.950259 -0.534944 -0.534883 -0.534944 -0.534883 -0.282278 -0.282278 0.139422 0.139422 0.139422 0.139421 -0.008010 -0.008010 0.262026
polarizability: 2.42779918e+02 -4.27199922e-06 1.25894820e+02 -1.67891945e-01 -3.08104259e-03 1.37578911e+02
1716.lowfreq: -0.0027 -0.0020 0.0003 3.1727 4.8411 8.0097 9.1531 9.1997 37.3910
frequency: 8.0207 9.1359 37.3830 42.2413 42.3961 52.2918 85.2132 96.0257 112.9416 172.7224 172.7964 197.4873 199.6313 226.1651 230.6653 234.1651 285.9238 318.5397 320.4102 349.9143 350.3794 384.2460 415.3180 490.2342 497.3336 573.1436 644.5737 746.9190 746.9265 752.8256 753.1840 771.8599 811.2719 816.4217 821.4524 825.2655 826.9880 909.8255 930.5251 968.5378 968.7834 1032.1730 1038.4878 1057.5109 1076.8279 1076.8875 1094.5189 1096.4961 1096.7514 1099.6710 1112.9193 1161.0113 1161.0658 1208.6759 1208.8543 1218.0641 1244.5420 1262.9086 1301.8338 1349.8576 1411.0456 1418.0950 1460.5102 1460.5234 1470.1226 1470.1400 1487.6571 3009.4235 3052.6398 3055.3769 3074.4715 3080.0746 3080.0843 3085.7760 3085.8362 3142.0169 3145.8057 3184.6383 3184.6407 3201.9789 3201.9832
redmass: 4.4759 8.4740 3.4539 5.4900 3.5462 4.3819 6.9427 2.0267 9.1012 4.0499 4.0935 4.7882 6.0872 3.9855 6.0897 3.0693 5.2197 7.2471 7.0084 3.9945 4.1065 4.5043 5.1364 16.2771 7.5337 9.2032 5.2137 8.1632 8.3156 1.9249 1.9051 1.1190 1.4321 15.4175 6.6498 1.7431 2.0850 4.6188 5.1996 1.0755 1.0752 4.8279 1.6992 3.0857 1.2718 1.2693 1.3505 1.2535 1.3683 1.2993 1.1462 1.3778 1.3777 3.2553 3.3237 1.1881 1.2928 1.2138 1.0855 1.3324 1.1178 1.0909 1.0732 1.0731 1.1512 1.1511 1.0845 1.0594 1.0563 1.0555 1.1052 1.0494 1.0495 1.0626 1.0626 1.1108 1.1099 1.1169 1.1169 1.1158 1.1158
irintensity: 0.0001 0.0004 0.0049 0.4353 11.3531 0.0014 0.5973 0.9675 1.7410 0.0068 2.7424 7.6332 84.1251 0.2813 0.5605 0.0003 44.5746 0.0259 9.7378 0.0027 1.8947 0.8545 25.2604 6.9434 80.2557 102.2598 0.4704 0.0595 0.0003 59.8425 3.5768 2.8136 0.0118 2.7486 57.4689 88.9694 71.3910 113.3856 0.0146 0.6239 0.0007 0.6018 38.1549 1.7537 15.9371 26.3300 13.4526 0.0020 0.0033 18.7738 0.0027 0.5478 0.0003 26.1903 1.9731 0.5735 2.1911 3.3005 0.0000 38.3242 0.2113 11.2546 2.9425 28.0370 3.3888 6.2662 14.4764 0.0342 5.7669 2.3876 0.1677 0.0052 3.9204 29.7432 3.9646 0.0000 0.9784 0.0091 6.7336 0.0635 4.3592
temp: 298.150 k
press: 1.00000 atm
elementType: 16 16 8 8 8 8 7 7 6 6 6 6 6 6 6 1 1 1 1 1 1 1 1 1 1 1 1 1 1
symmnumber: 1
zpe: 561419.3 jmol-1
zpe.correction: 0.213833 hartree
zpe.thermalcorrener: 0.232807 hartree
zpe.thermalcorrenthalpy: 0.233751 hartree
zpe.thermalcorrgfe: 0.161154 hartree
zpe.sumelectzpe: -1480.029940 hartree
zpe.sumelectthermal: -1480.010966 hartree
zpe.sumelectthermalent: -1480.010022 hartree
zpe.sumelectthermalfe: -1480.082619 hartree
dipole: 0.0000 -6.7050 -0.0016
dipole: 6.7050
quadrupole: -74.3797 -114.3392 -113.9646
quadrupole: 0.0001 -0.2548 0.0001
quadrupole: 26.5148 -13.4447 -13.0701 0.0001 -0.2548 0.0001
hfenergy: -1480.2437728 hartree
pointgroup: C01 [X(C7H14N2O4S2)]
dipole: -0.0000084 -2.6379573 -0.0002743 debye
polarizability: 242.2592867|-0.0010615|125.8948189|7.3843111|-0.0015888|138.0995429 unknown
InChI: InChI=1S/C7H14N2O4S2/c10-14(11,8-2-3-8)6-1-7-15(12,13)9-4-5-9/h1-7H2
charge 0 multiplicity 1
29 atoms
S  -2.81321 0.357121 -0.208313
S  2.813221 0.357066 0.208359
O  -2.989036 1.182188 1.187939
O  -2.794607 1.156895 -1.630247
O  2.989123 1.182422 -1.187714
O  2.79455 1.156545 1.630456
N  -4.135485 -1.104013 -0.287456
N  4.135486 -1.104092 0.287267
C  -5.335951 -0.660202 -1.135056
C  -5.444238 -0.645912 0.371441
C  5.335924 -0.66045 1.134994
C  5.444266 -0.645876 -0.371496
C  -1.240957 -0.751012 -0.090322
C  1.240969 -0.751035 0.090055
C  0.000006 0.145027 -0.000023
H  -5.77073 -1.477885 -1.717489
H  -5.241058 0.294625 -1.667217
H  -5.426091 0.31888 0.893591
H  -5.958683 -1.45323 0.901024
H  5.24102 0.294276 1.667333
H  5.770677 -1.478247 1.717288
H  5.958724 -1.453097 -0.901212
H  5.426146 0.319015 -0.893465
H  -1.297109 -1.362705 -1.004483
H  -1.430303 -1.360368 0.807361
H  1.297107 -1.362969 1.004056
H  1.430328 -1.360155 -0.807786
H  -0.065153 0.793533 0.893455
H  0.065165 0.793754 -0.893341
