program: Gaussian 09
title: 000087945
version: EM64L-G09RevD.01
frameworkgroup: C1[X(C6H14N2O2)]
method: RPBEPBE
basis: SDD
operation: Freq
keyword: #p
keyword: freq=noraman
keyword: PBEPBE/SDD
title: #p freq=noraman PBEPBE/SDD
converged: YES YES NO NO
title: Mulliken charges:
elementType: O O N N C C C C C C H H H H H H H H H H H H H H
charge: -0.205837 -0.230086 -0.093984 0.086949 0.351600 -0.439722 -0.721575 -0.711196 -0.628694 -0.631429 0.254740 0.229797 0.229314 0.232956 0.230416 0.240619 0.225674 0.239319 0.206061 0.225384 0.238913 0.205383 0.238941 0.226457
chargesum: 0.00000
title: Mulliken charges with hydrogens summed into heavy atoms:
elementType: O O N N C C C C C C
charge: -0.205837 -0.230086 -0.093984 0.086949 0.351600 0.044816 -0.028889 -0.005584 0.041663 0.039352
polarizability: 1.18215839e+02 2.59698161e+00 8.93074029e+01 -2.27243459e+00 1.09388591e+00 7.39527717e+01
1716.lowfreq: -6.9904 -0.0010 -0.0006 -0.0006 7.0363 17.6093 46.1185 62.7497 81.3826
frequency: 46.0841 62.7011 81.2244 134.2880 196.1286 206.5989 216.7715 223.3992 257.2660 266.9649 293.0722 303.1222 347.2065 387.5138 430.7242 438.9516 501.5079 600.2967 654.3111 754.2865 783.4321 832.7825 912.1357 947.5994 969.5725 1013.3022 1044.6816 1053.0132 1089.5741 1124.9824 1129.0316 1136.6875 1197.3710 1225.0869 1269.5553 1291.1041 1337.5098 1347.6958 1365.0619 1386.4143 1395.0185 1424.1068 1441.9563 1458.8259 1463.5808 1468.2690 1470.4013 1473.6359 1478.6085 1481.8396 1489.5820 1492.9688 2874.6206 2882.9245 2962.1497 2995.7681 3001.6715 3024.1014 3025.4005 3035.6795 3084.9633 3089.2366 3095.5604 3103.8558 3105.0354 3110.2387
redmass: 8.7659 2.9833 2.7153 2.7748 1.4137 1.1598 1.7343 1.1830 1.5749 1.5718 2.6423 3.9815 2.8375 2.5261 2.7186 1.8067 4.3478 3.2828 7.5531 6.6294 4.7475 4.0815 1.6843 1.3497 2.0538 1.4026 1.5297 2.1159 1.2459 1.6255 1.7254 1.6066 4.4049 3.7372 3.9420 2.9499 1.5498 1.2550 1.4613 2.1893 1.7140 1.1364 1.1307 1.0510 1.0611 1.0465 1.1070 1.0520 1.0522 1.0537 1.0626 1.0582 1.0550 1.0553 1.0599 1.0346 1.0355 1.0762 1.0760 1.1034 1.1001 1.1002 1.1001 1.0996 1.1003 1.1005
irintensity: 0.1882 1.4298 0.4033 3.5483 2.3348 1.4468 2.8604 0.6054 1.5949 0.8019 8.5747 1.2089 3.4969 4.5775 1.4162 0.4599 3.4618 4.4851 12.7874 10.4268 38.0094 17.1234 6.8836 0.7464 6.7439 0.1078 19.0883 146.0375 3.7396 15.1918 17.5100 15.5657 130.9259 29.9568 1.9381 23.6131 0.1735 4.9454 97.3896 90.0034 23.9977 3.8116 4.3142 0.4150 4.6240 14.3671 15.0592 19.6105 13.5955 10.3634 14.1768 23.4096 69.8617 218.1214 35.3335 15.1214 9.8988 18.6413 58.8142 10.4659 17.0231 44.5057 5.4641 15.0348 18.4940 12.1164
temp: 298.150 k
press: 1.00000 atm
elementType: 8 8 7 7 6 6 6 6 6 6 1 1 1 1 1 1 1 1 1 1 1 1 1 1
symmnumber: 1
zpe: 531076.2 jmol-1
zpe.correction: 0.202276 hartree
zpe.thermalcorrener: 0.214653 hartree
zpe.thermalcorrenthalpy: 0.215597 hartree
zpe.thermalcorrgfe: 0.164100 hartree
zpe.sumelectzpe: -496.056755 hartree
zpe.sumelectthermal: -496.044378 hartree
zpe.sumelectthermalent: -496.043434 hartree
zpe.sumelectthermalfe: -496.094931 hartree
dipole: -4.7203 0.5563 1.3622
dipole: 4.9443
quadrupole: -69.3803 -62.7276 -61.5087
quadrupole: 0.9219 6.1103 -1.6677
quadrupole: -4.8415 1.8113 3.0302 0.9219 6.1103 -1.6677
hfenergy: -496.2590313 hartree
pointgroup: C01 [X(C6H14N2O2)]
dipole: 1.8474868 -0.2949475 -0.532642 debye
dipolederiv: -0.6226542 0.3047085 -0.0756558 0.5465772 -0.5315145 0.2442697 0.0456948 0.1244033 -0.4357005 -0.4039585 0.0012896 0.1941802 0.0451167 -0.4401156 0.1577265 0.3640337 0.2640236 -0.6715387 -0.9565185 -0.0329211 -0.1128116 0.2126415 -0.5242228 0.0078954 0.3426113 -0.0125919 -0.4913862 0.9442771 -0.3835321 -0.1724693 -0.7804234 0.6105532 -0.410673 -0.684432 -0.3864664 0.7503852 -0.4259835 0.1038321 0.0366273 0.081549 0.1843408 -0.0145462 -0.0479127 0.014163 0.2332519 1.0222947 -0.0412432 0.012522 0.0394186 0.1155281 0.0578604 0.1840677 0.0450389 0.0943288 0.0029272 0.0081198 -0.0032424 -0.0080495 -0.0227957 0.0674681 0.0207163 0.0531514 -0.1013063 -0.0194837 -0.017723 0.0247351 0.0023471 -0.073181 0.0227476 0.0809254 0.0024851 -0.0059164 0.3013034 -0.1458263 0.1917552 -0.3660676 0.28461 -0.0455046 0.1719106 -0.0153889 0.3945219 0.3541902 0.2406147 0.0038856 0.3528279 0.3336607 0.080965 -0.1522589 0.0493377 0.2872482 -0.0116724 -0.0201708 0.0121403 -0.0477563 0.0505531 0.1023601 -0.0085775 0.0559079 -0.0645103 -0.0039804 0.0093003 -0.0234384 0.0074928 -0.1511443 -0.074414 -0.0689844 -0.0214662 0.0742621 0.1018133 -0.0036244 -0.0110583 -0.0232568 -0.1151169 -0.014617 0.0059558 -0.0530743 0.0725481 -0.0315369 -0.040923 -0.1303168 -0.0609199 0.0688917 -0.0337591 -0.0686522 -0.0237463 0.0043686 -0.0344126 0.0268184 0.1189357 0.0502505 0.0824006 -0.0273417 0.0734071 -0.0122614 0.0732908 0.1123434 -0.0180687 0.0087906 -0.0050938 0.0380312 0.0520885 0.0065026 0.11204 -0.0443363 -0.0269672 -0.0677626 -0.1231239 -0.0044295 0.051922 -0.0263914 -0.1139783 -0.0608638 -0.0057525 -0.0083149 0.0770051 0.0837293 0.0517904 0.084152 -0.0132308 0.0701254 -0.0160466 0.0793303 -0.0619476 0.0491049 -0.115144 0.0047869 -0.0011809 -0.1106635 -0.2505864 0.0204629 -0.2198632 -0.1133001 0.1119022 0.0634241 0.0597414 0.0760455 -0.0206929 0.1274865 -0.0497256 -0.0018674 0.0285638 -0.1400797 0.0219802 -0.0812967 -0.0668112 0.0364347 0.0033491 0.0471731 0.0686496 -0.0754216 -0.1163977 -0.0292834 -0.1991123 -0.0769267 -0.0596821 -0.1603565 -0.1777389 -0.1288745 0.0453261 0.0924705 -0.0906489 0.0403904 -0.0323083 0.0908418 -0.0575861 0.0842261 0.0130524 -0.1168871 0.0031064 0.1144871 0.0814757 0.0546291 -0.0691416 0.1165388 -0.0430428 0.0258141 unknown
polarizability: 117.6266709|-5.6832172|82.52991|-0.2070563|-7.7867009|81.3194328 unknown
InChI: InChI=1S/C6H14N2O2/c1-6(2,8(9)10)5-7(3)4/h5H2,1-4H3
charge 0 multiplicity 1
24 atoms
O  -2.621997 1.102344 -0.033728
O  -2.107234 -0.469681 1.531059
N  1.915216 -0.154562 0.1290
N  -1.877151 0.158332 0.425674
C  -0.571429 -0.220216 -0.33292
C  0.590803 0.180675 0.663725
C  -0.493846 0.565051 -1.646844
C  -0.591431 -1.742898 -0.567694
C  2.649025 -1.205204 0.859246
C  2.75842 0.992812 -0.253784
H  0.399516 -0.344631 1.619056
H  0.508578 1.268841 0.863571
H  -0.530839 1.654092 -1.477334
H  -1.325582 0.300009 -2.320968
H  0.459255 0.304288 -2.138317
H  -0.755329 -2.288295 0.376406
H  -1.384413 -2.024251 -1.282611
H  0.385173 -2.029585 -0.993952
H  3.034498 -0.863567 1.850969
H  3.512877 -1.542241 0.257498
H  1.995559 -2.077368 1.029349
H  3.153262 1.560324 0.624579
H  2.184545 1.69358 -0.883434
H  3.622824 0.638951 -0.844745
